{"text_format":"1","workbook":"xlsx","n_sheets":7,"sheets":["DADOS","FICHA DE PROJETO","PARECER URBANÍSTICO","QUESTIONÁRIO AMBIENTAL","RELATÓRIO FOTOGRÁFICO","ANÁLISE TÉCNICA","Municípios_CNPJ"],"not_rendered":{"charts":0,"images":16,"macros":1,"external_links":0,"defined_names":16,"comments":0,"pivot_tables":0},"unopened":[],"bounds":{"document_bytes":16777216,"sheet_cells":100000,"rows_first":2000,"rows_last":500,"rows_between":2000,"halvings":0,"cell_chars":16384,"cell_head_chars":4096},"cells_cut":0,"cells_raw":0,"read":"whole","date_system":"1900"}

{"sheet":"DADOS","index":0,"n_rows":188,"n_cols":2,"rows_kept":188,"cut":false,"hidden":true,"merged":[]}
[]
[]
[null,"R01"]
[null,"R02"]
[null,"R03"]
[null,"R04"]
[null,"R05"]
[null,"R06"]
[null,"R07"]
[null,"R08"]
[null,"R09"]
[null,"R10"]
[null,"R11"]
[null,"R12"]
[null,"R13"]
[null,"R14"]
[null,"R15"]
[null,"R16"]
[null,"R17"]
[null,"R18"]
[null,"R19"]
[null,"R20"]
[null,"R21"]
[null,"R22"]
[null,"R23"]
[null,"R24"]
[null,"R25"]
[null,"R26"]
[null,"R27"]
[null,"R28"]
[null,"R29"]
[null,"R30"]
[null,"R31"]
[null,"R32"]
[null,"R33"]
[null,"R34"]
[null,"R35"]
[null,"R36"]
[null,"R37"]
[null,"R38"]
[null,"R39"]
[null,"R40"]
[null,"R41"]
[null,"R42"]
[null,"R43"]
[null,"R44"]
[null,"R45"]
[null,"R46"]
[null,"R47"]
[null,"R48"]
[null,"R49"]
[null,"R50"]
[null,"R51"]
[null,"R52"]
[null,"R53"]
[null,"R54"]
[null,"R55"]
[null,"R56"]
[null,"R57"]
[null,"R58"]
[null,"R59"]
[null,"R60"]
[null,"R61"]
[null,"R62"]
[null,"R63"]
[null,"R64"]
[null,"R65"]
[null,"R66"]
[null,"R67"]
[null,"R68"]
[null,"R69"]
[null,"R70"]
[null,"R71"]
[null,"R72"]
[null,"R73"]
[null,"R74"]
[null,"R75"]
[null,"R76"]
[null,"R77"]
[null,"R78"]
[null,"R79"]
[null,"R80"]
[null,"R81"]
[null,"R82"]
[null,"R83"]
[null,"R84"]
[null,"R85"]
[null,"R86"]
[null,"R87"]
[null,"R88"]
[null,"R89"]
[null,"R90"]
[null,"R91"]
[null,"R92"]
[null,"R93"]
[null,"R94"]
[null,"R95"]
[null,"R96"]
[null,"R97"]
[null,"R98"]
[null,"R99"]
[null,"R100"]
[null,"R101"]
[null,"R102"]
[null,"R103"]
[null,"R104"]
[null,"R105"]
[null,"R106"]
[null,"R107"]
[null,"R108"]
[null,"R109"]
[null,"R110"]
[null,"R111"]
[null,"R112"]
[null,"R113"]
[null,"R114"]
[null,"R115"]
[null,"R116"]
[null,"R117"]
[null,"R118"]
[null,"R119"]
[null,"R120"]
[null,"R121"]
[null,"R122"]
[null,"R123"]
[null,"R124"]
[null,"R125"]
[null,"R126"]
[null,"R127"]
[null,"R128"]
[null,"R129"]
[null,"R130"]
[null,"R131"]
[null,"R132"]
[null,"R133"]
[null,"R134"]
[null,"R135"]
[null,"R136"]
[null,"R137"]
[null,"R138"]
[null,"R139"]
[null,"R140"]
[null,"R141"]
[null,"R142"]
[null,"R143"]
[null,"R144"]
[null,"R145"]
[null,"R146"]
[null,"R147"]
[null,"R148"]
[null,"R149"]
[null,"R150"]
[null,"R151"]
[null,"R152"]
[null,"R153"]
[null,"R154"]
[null,"R155"]
[null,"R156"]
[null,"R157"]
[null,"R158"]
[null,"R159"]
[null,"R160"]
[null,"R161"]
[null,"R162"]
[null,"R163"]
[null,"R164"]
[null,"R165"]
[null,"R166"]
[null,"R167"]
[null,"R168"]
[null,"R169"]
[null,"R170"]
[null,"R171"]
[null,"R172"]
[null,"R173"]
[null,"R174"]
[null,"R175"]
[null,"R176"]
[null,"R177"]
[null,"R178"]
[null,"R179"]
[null,"X"]
[null," Lote 01"]
[null," Lote 02"]
[null," Lote 03"]
[null," Lote 04"]
[null," objeto"]
[null,"R180"]

{"sheet":"FICHA DE PROJETO","index":1,"n_rows":804,"n_cols":96,"rows_kept":804,"cut":false,"hidden":false,"merged":[[798,2,798,5],[762,0,762,8],[27,0,27,8],[29,0,29,8],[787,0,787,8],[791,0,791,8],[789,0,789,8],[785,0,785,8],[792,0,792,8],[793,0,793,8],[779,0,779,8],[783,0,783,8],[763,2,763,3],[767,2,767,3],[764,2,764,3],[771,2,771,3],[0,0,0,1],[18,1,18,4],[21,0,21,8],[23,0,23,8],[0,2,0,7],[5,1,5,4],[5,7,5,8],[14,1,14,4],[16,1,16,2],[9,7,9,8],[11,1,11,4],[7,1,7,4],[9,2,9,3],[11,7,11,8],[3,0,3,8],[7,7,7,8],[14,7,14,8],[16,7,16,8],[18,7,18,8],[772,2,772,3],[773,2,773,3],[579,7,579,8],[16,3,16,4],[25,0,25,8],[31,7,31,8],[214,7,214,8],[397,7,397,8],[774,2,774,3],[775,2,775,3],[765,2,765,3],[766,2,766,3],[769,0,769,8]]}
[null,null,"Governo do Estado do Paraná\nSecretaria das Cidades\nRua Jacy Loureiro de Campos, nº 180| 2º andar | Centro Cívico  CEP 80530-140 | Caixa Postal 15079\nCuritiba | Paraná | Fone (41) 3350 – 3300  http://www.paranacidade.org.br/"]
[]
[]
["FICHA DE PROJETO"]
[]
["Município:","CAFEARA",null,null,null,null,"CNPJ:",{"$f":"VLOOKUP(B6,Municípios_CNPJ!$B$3:$F$401,5,FALSE)","v":75845545000106},null,null,null,null,"Formatação do CNPJ:      00\".\"000\".\"000\"/\"0000-00"]
[]
["Projeto:","Pavimentação Asfáltica em CBUQ",null,null,null,null,"Componente: ","Sistema Viário"]
[]
["Prioridade:",49,"Programa",null,"PAM",null,"Convênio:"]
[]
["Valor do Repasse:",null,null,null,null,null,"Contrapartida:"]
[null,","]
[]
["Contato:","Luiz Eduardo Candido",null,null,null,null,"CPF:","063.225.***"]
[]
["CAU/CREA:","CREA PR - 145.164/D",null,null,null,null,"Cargo:","Engenheiro Civil"]
[]
["e-mail:","lecandido.candido@gmail.com",null,null,null,null,"Telefone:","(44) 98409-2602"]
[]
[]
["01. DESCRIÇÃO DO OBJETO"]
[]
["Pavimentação de vias urbanas em CBUQ,  10.892,70 m2, incluindo serviços preliminares, terraplenagem, base e sub-base, revestimento, meio-fio e sarjeta, urbanização, sinalização de trânsito, drenagem e ensaios tecnológicos.",null,null,null,null,null,null,null,null,"MESMO PREENCHIMENTO DO SAM"]
[]
["02. LOCALIZAÇÃO"]
[]
["Vias urbanas na Sede do Município",null,null,null,null,null,null,null,null,"MESMO PREENCHIMENTO DO SAM"]
[]
["03. OBJETO (VIAS A SEREM PAVIMENTADAS)"]
["Número de Lotes do Projeto:",null,1,null,null,null,null,null,null,null,"x"]
[" Lote 01",null,null,null,null,null,null,"Coordenadas UTM",null,null,{"$f":"IF($C$31>0,\"x\",\"vazia\")","v":"x"},"← Na \"Coluna A\", na linha que estiver vazia, inserir OBJETO RUA, no formato R01; R02; R03;...."]
[" objeto","Descrição da rua (entre trechos)",null,null,null,null,"Sequência","Coordenada X","Coordenada Y",null,{"$f":"IF($C$31>0,\"x\",\"vazia\")","v":"x"},"← Na \"Coluna B\", na linha que estiver vazia, inserir DESCRIÇÃO DA RUA (NOME): Ex.: Rua Paraná (entre Rua Aracajú e Rua Vitória)"]
["R01","RUA VITAL PIRES DE LIMA entre a Avenida Paraná e Rua Silvio Picinini;",null,null,null,null,null,null,null,null,{"$f":"IF($C$31>0,\"x\",\"vazia\")","v":"x"},"← Na \"Coluna G\", na célula vazia em frente ao nome da Rua, inserir a \"Sequência\" da coleta de coordenadas UTM, preenchendo com 1; 2; 3; ...."]
["R01",null,null,null,null,null,1,426413.07,7479969.9900000002,null,{"$f":"IF((A34>0),\"X\",\"vazia\")","v":"X"}]
["R01",null,null,null,null,null,2,426655,7480194,null,{"$f":"IF((A35>0),\"X\",\"vazia\")","v":"X"}]
["R02","RUA MATIAS APARECIDO FOGAÇA entre as Ruas Vital Pires de Lima e Ângelo Bianco;",null,null,null,null,null,null,null,null,{"$f":"IF((A36>0),\"X\",\"vazia\")","v":"X"}]
["R02",null,null,null,null,null,1,426524.9,7480074.0199999996,null,"X"]
["R02",null,null,null,null,null,2,426599.04,7480002.6500000004,null,"X"]
["R03","RUA SÍLVIO PICININI entre as Ruas Vital Pires de Lima e Virgínio Turozi;",null,null,null,null,null,null,null,null,"X"]
["R03",null,null,null,null,null,1,426643.26,7480194.5,null,"X"]
["R03",null,null,null,null,null,2,426802.64,7480031.0099999998,null,"X"]
["R04","RUA HÉLIO BARCO entre as Ruas Angelo Bianco e Virgínio Turozi;",null,null,null,null,null,null,null,null,"X"]
["R04",null,null,null,null,null,1,426842,7480223,null,"X"]
["R04",null,null,null,null,null,2,426913.32,7480146.5199999996,null,"X"]
["R05","RUA ÂNGELO BIANCO entre as Ruas Sílvio Picinini e Hélio Barco.",null,null,null,null,null,null,null,null,"X"]
["R05",null,null,null,null,null,1,426724.59,7480117.1399999997,null,"X"]
["R05",null,null,null,null,null,2,426832.55,7480223.8799999999,null,"X"]
["R06","RUA PROJETADA \"A\" entre as Ruaas Sílvio Picinini e Hélio Barco;",null,null,null,null,null,null,null,null,{"$f":"IF((A48>0),\"X\",\"vazia\")","v":"X"}]
["R06",null,null,null,null,null,1,426766.09,7480075.1799999997,null,"X"]
["R06",null,null,null,null,null,2,426872.95,7480181.9199999999,null,{"$f":"IF((A50>0),\"X\",\"vazia\")","v":"X"}]
["R07","RUA HELENA DEOTTI COSTA com início na Rua João Sperandio até o final a 100,00m;",null,null,null,null,null,null,null,null,{"$f":"IF((A51>0),\"X\",\"vazia\")","v":"X"}]
["R07",null,null,null,null,null,1,426990.13,7479152.9400000004,null,{"$f":"IF((A52>0),\"X\",\"vazia\")","v":"X"}]
["R07",null,null,null,null,null,2,427062.32,7479082.6600000001,null,"X"]
["R08","RUA BOIADEIRO entre a Rua Dionísio Ternulina da Silva e Travessa \"C\".",null,null,null,null,null,null,null,null,"X"]
["R08",null,null,null,null,null,1,426633.99,7478798.04,null,{"$f":"IF((A55>0),\"X\",\"vazia\")","v":"X"}]
["R08",null,null,null,null,null,2,426873.5,7478799.2000000002,null,"X"]
[null,null,null,null,null,null,null,null,null,null,"X"]
[null,null,null,null,null,null,null,null,null,null,"vazia"]
[null,null,null,null,null,null,null,null,null,null,{"$f":"IF((A59>0),\"X\",\"vazia\")","v":"vazia"}]
[null,null,null,null,null,null,null,null,null,null,"vazia"]
[null,null,null,null,null,null,null,null,null,null,"vazia"]
[null,null,null,null,null,null,null,null,null,null,"vazia"]
[null,null,null,null,null,null,null,null,null,null,"vazia"]
[null,null,null,null,null,null,null,null,null,null,"vazia"]
[null,null,null,null,null,null,null,null,null,null,"vazia"]
[null,null,null,null,null,null,null,null,null,null,"vazia"]
[null,null,null,null,null,null,null,null,null,null,"vazia"]
[null,null,null,null,null,null,null,null,null,null,"vazia"]
[null,null,null,null,null,null,null,null,null,null,"vazia"]
[null,null,null,null,null,null,null,null,null,null,"vazia"]
[null,null,null,null,null,null,null,null,null,null,"vazia"]
[null,null,null,null,null,null,null,null,null,null,"vazia"]
[null,null,null,null,null,null,null,null,null,null,"vazia"]
[null,null,null,null,null,null,null,null,null,null,"vazia"]
[null,null,null,null,null,null,null,null,null,null,"vazia"]
[null,null,null,null,null,null,null,null,null,null,"vazia"]
[null,null,null,null,null,null,null,null,null,null,"vazia"]
[null,null,null,null,null,null,null,null,null,null,"vazia"]
[null,null,null,null,null,null,null,null,null,null,"vazia"]
[null,null,null,null,null,null,null,null,null,null,"vazia"]
[null,null,null,null,null,null,null,null,null,null,"vazia"]
[null,null,null,null,null,null,null,null,null,null,"vazia"]
[null,null,null,null,null,null,null,null,null,null,"vazia"]
[null,null,null,null,null,null,null,null,null,null,"vazia"]
[null,null,null,null,null,null,null,null,null,null,"vazia"]
[null,null,null,null,null,null,null,null,null,null,"vazia"]
[null,null,null,null,null,null,null,null,null,null,"vazia"]
[null,null,null,null,null,null,null,null,null,null,"vazia"]
[null,null,null,null,null,null,null,null,null,null,"vazia"]
[null,null,null,null,null,null,null,null,null,null,"vazia"]
[null,null,null,null,null,null,null,null,null,null,"vazia"]
[null,null,null,null,null,null,null,null,null,null,"vazia"]
[null,null,null,null,null,null,null,null,null,null,"vazia"]
[null,null,null,null,null,null,null,null,null,null,"vazia"]
[null,null,null,null,null,null,null,null,null,null,"vazia"]
[null,null,null,null,null,null,null,null,null,null,"vazia"]
[null,null,null,null,null,null,null,null,null,null,"vazia"]
[null,null,null,null,null,null,null,null,null,null,{"$f":"IF((A98>0),\"X\",\"vazia\")","v":"vazia"}]
[null,null,null,null,null,null,null,null,null,null,"vazia"]
[null,null,null,null,null,null,null,null,null,null,"vazia"]
[null,null,null,null,null,null,null,null,null,null,"vazia"]
[null,null,null,null,null,null,null,null,null,null,"vazia"]
[null,null,null,null,null,null,null,null,null,null,"vazia"]
[null,null,null,null,null,null,null,null,null,null,"vazia"]
[null,null,null,null,null,null,null,null,null,null,"vazia"]
[null,null,null,null,null,null,null,null,null,null,"vazia"]
[null,null,null,null,null,null,null,null,null,null,"vazia"]
[null,null,null,null,null,null,null,null,null,null,"vazia"]
[null,null,null,null,null,null,null,null,null,null,"vazia"]
[null,null,null,null,null,null,null,null,null,null,"vazia"]
[null,null,null,null,null,null,null,null,null,null,"vazia"]
[null,null,null,null,null,null,null,null,null,null,"vazia"]
[null,null,null,null,null,null,null,null,null,null,"vazia"]
[null,null,null,null,null,null,null,null,null,null,"vazia"]
[null,null,null,null,null,null,null,null,null,null,"vazia"]
[null,null,null,null,null,null,null,null,null,null,"vazia"]
[null,null,null,null,null,null,null,null,null,null,"vazia"]
[null,null,null,null,null,null,null,null,null,null,"vazia"]
[null,null,null,null,null,null,null,null,null,null,"vazia"]
[null,null,null,null,null,null,null,null,null,null,"vazia"]
[null,null,null,null,null,null,null,null,null,null,"vazia"]
[null,null,null,null,null,null,null,null,null,null,"vazia"]
[null,null,null,null,null,null,null,null,null,null,"vazia"]
[null,null,null,null,null,null,null,null,null,null,"vazia"]
[null,null,null,null,null,null,null,null,null,null,"vazia"]
[null,null,null,null,null,null,null,null,null,null,"vazia"]
[null,null,null,null,null,null,null,null,null,null,"vazia"]
[null,null,null,null,null,null,null,null,null,null,"vazia"]
[null,null,null,null,null,null,null,null,null,null,"vazia"]
[null,null,null,null,null,null,null,null,null,null,"vazia"]
[null,null,null,null,null,null,null,null,null,null,"vazia"]
[null,null,null,null,null,null,null,null,null,null,"vazia"]
[null,null,null,null,null,null,null,null,null,null,"vazia"]
[null,null,null,null,null,null,null,null,null,null,"vazia"]
[null,null,null,null,null,null,null,null,null,null,"vazia"]
[null,null,null,null,null,null,null,null,null,null,"vazia"]
[null,null,null,null,null,null,null,null,null,null,"vazia"]
[null,null,null,null,null,null,null,null,null,null,"vazia"]
[null,null,null,null,null,null,null,null,null,null,"vazia"]
[null,null,null,null,null,null,null,null,null,null,"vazia"]
[null,null,null,null,null,null,null,null,null,null,"vazia"]
[null,null,null,null,null,null,null,null,null,null,"vazia"]
[null,null,null,null,null,null,null,null,null,null,"vazia"]
[null,null,null,null,null,null,null,null,null,null,"vazia"]
[null,null,null,null,null,null,null,null,null,null,"vazia"]
[null,null,null,null,null,null,null,null,null,null,"vazia"]
[null,null,null,null,null,null,null,null,null,null,"vazia"]
[null,null,null,null,null,null,null,null,null,null,"vazia"]
[null,null,null,null,null,null,null,null,null,null,"vazia"]
[null,null,null,null,null,null,null,null,null,null,"vazia"]
[null,null,null,null,null,null,null,null,null,null,"vazia"]
[null,null,null,null,null,null,null,null,null,null,"vazia"]
[null,null,null,null,null,null,null,null,null,null,"vazia"]
[null,null,null,null,null,null,null,null,null,null,"vazia"]
[null,null,null,null,null,null,null,null,null,null,"vazia"]
[null,null,null,null,null,null,null,null,null,null,"vazia"]
[null,null,null,null,null,null,null,null,null,null,"vazia"]
[null,null,null,null,null,null,null,null,null,null,"vazia"]
[null,null,null,null,null,null,null,null,null,null,"vazia"]
[null,null,null,null,null,null,null,null,null,null,"vazia"]
[null,null,null,null,null,null,null,null,null,null,"vazia"]
[null,null,null,null,null,null,null,null,null,null,{"$f":"IF((A162>0),\"X\",\"vazia\")","v":"vazia"}]
[null,null,null,null,null,null,null,null,null,null,"vazia"]
[null,null,null,null,null,null,null,null,null,null,"vazia"]
[null,null,null,null,null,null,null,null,null,null,"vazia"]
[null,null,null,null,null,null,null,null,null,null,"vazia"]
[null,null,null,null,null,null,null,null,null,null,"vazia"]
[null,null,null,null,null,null,null,null,null,null,"vazia"]
[null,null,null,null,null,null,null,null,null,null,"vazia"]
[null,null,null,null,null,null,null,null,null,null,"vazia"]
[null,null,null,null,null,null,null,null,null,null,"vazia"]
[null,null,null,null,null,null,null,null,null,null,"vazia"]
[null,null,null,null,null,null,null,null,null,null,"vazia"]
[null,null,null,null,null,null,null,null,null,null,"vazia"]
[null,null,null,null,null,null,null,null,null,null,"vazia"]
[null,null,null,null,null,null,null,null,null,null,"vazia"]
[null,null,null,null,null,null,null,null,null,null,"vazia"]
[null,null,null,null,null,null,null,null,null,null,"vazia"]
[null,null,null,null,null,null,null,null,null,null,"vazia"]
[null,null,null,null,null,null,null,null,null,null,"vazia"]
[null,null,null,null,null,null,null,null,null,null,"vazia"]
[null,null,null,null,null,null,null,null,null,null,"vazia"]
[null,null,null,null,null,null,null,null,null,null,"vazia"]
[null,null,null,null,null,null,null,null,null,null,"vazia"]
[null,null,null,null,null,null,null,null,null,null,"vazia"]
[null,null,null,null,null,null,null,null,null,null,"vazia"]
[null,null,null,null,null,null,null,null,null,null,"vazia"]
[null,null,null,null,null,null,null,null,null,null,"vazia"]
[null,null,null,null,null,null,null,null,null,null,"vazia"]
[null,null,null,null,null,null,null,null,null,null,"vazia"]
[null,null,null,null,null,null,null,null,null,null,"vazia"]
[null,null,null,null,null,null,null,null,null,null,"vazia"]
[null,null,null,null,null,null,null,null,null,null,"vazia"]
[null,null,null,null,null,null,null,null,null,null,"vazia"]
[null,null,null,null,null,null,null,null,null,null,"vazia"]
[null,null,null,null,null,null,null,null,null,null,"vazia"]
[null,null,null,null,null,null,null,null,null,null,"vazia"]
[null,null,null,null,null,null,null,null,null,null,"vazia"]
[null,null,null,null,null,null,null,null,null,null,"vazia"]
[null,null,null,null,null,null,null,null,null,null,"vazia"]
[null,null,null,null,null,null,null,null,null,null,"vazia"]
[null,null,null,null,null,null,null,null,null,null,"vazia"]
[null,null,null,null,null,null,null,null,null,null,"vazia"]
[null,null,null,null,null,null,null,null,null,null,"vazia"]
[null,null,null,null,null,null,null,null,null,null,"vazia"]
[null,null,null,null,null,null,null,null,null,null,"vazia"]
[null,null,null,null,null,null,null,null,null,null,"vazia"]
[null,null,null,null,null,null,null,null,null,null,"vazia"]
[null,null,null,null,null,null,null,null,null,null,"vazia"]
[null,null,null,null,null,null,null,null,null,null,"vazia"]
[null,null,null,null,null,null,null,null,null,null,"vazia"]
[null,null,null,null,null,null,null,null,null,null,{"$f":"IF((A212>0),\"X\",\"vazia\")","v":"vazia"}]
[null,null,null,null,null,null,null,null,null,null,{"$f":"IF(($C$31>1),\"X\",\"vazia\")","v":"vazia"}]
[" Lote 02",null,null,null,null,null,null,"Coordenadas UTM",null,null,{"$f":"IF(($C$31>1),\"X\",\"vazia\")","v":"vazia"}]
[" objeto","Descrição da rua (entre trechos)",null,null,null,null,"Sequência","Coordenada X","Coordenada Y",null,{"$f":"IF(($C$31>1),\"X\",\"vazia\")","v":"vazia"}]
[null,null,null,null,null,null,null,null,null,null,{"$f":"IF(($C$31>1),\"X\",\"vazia\")","v":"vazia"}]
[null,null,null,null,null,null,null,null,null,null,{"$f":"IF((A217>0),\"X\",\"vazia\")","v":"vazia"}]
[null,null,null,null,null,null,null,null,null,null,{"$f":"IF((A218>0),\"X\",\"vazia\")","v":"vazia"}]
[null,null,null,null,null,null,null,null,null,null,"vazia"]
[null,null,null,null,null,null,null,null,null,null,"vazia"]
[null,null,null,null,null,null,null,null,null,null,"vazia"]
[null,null,null,null,null,null,null,null,null,null,"vazia"]
[null,null,null,null,null,null,null,null,null,null,"vazia"]
[null,null,null,null,null,null,null,null,null,null,"vazia"]
[null,null,null,null,null,null,null,null,null,null,{"$f":"IF((A225>0),\"X\",\"vazia\")","v":"vazia"}]
[null,null,null,null,null,null,null,null,null,null,{"$f":"IF((A226>0),\"X\",\"vazia\")","v":"vazia"}]
[null,null,null,null,null,null,null,null,null,null,"vazia"]
[null,null,null,null,null,null,null,null,null,null,"vazia"]
[null,null,null,null,null,null,null,null,null,null,"vazia"]
[null,null,null,null,null,null,null,null,null,null,"vazia"]
[null,null,null,null,null,null,null,null,null,null,"vazia"]
[null,null,null,null,null,null,null,null,null,null,"vazia"]
[null,null,null,null,null,null,null,null,null,null,"vazia"]
[null,null,null,null,null,null,null,null,null,null,"vazia"]
[null,null,null,null,null,null,null,null,null,null,"vazia"]
[null,null,null,null,null,null,null,null,null,null,"vazia"]
[null,null,null,null,null,null,null,null,null,null,"vazia"]
[null,null,null,null,null,null,null,null,null,null,"vazia"]
[null,null,null,null,null,null,null,null,null,null,"vazia"]
[null,null,null,null,null,null,null,null,null,null,"vazia"]
[null,null,null,null,null,null,null,null,null,null,"vazia"]
[null,null,null,null,null,null,null,null,null,null,"vazia"]
[null,null,null,null,null,null,null,null,null,null,"vazia"]
[null,null,null,null,null,null,null,null,null,null,"vazia"]
[null,null,null,null,null,null,null,null,null,null,"vazia"]
[null,null,null,null,null,null,null,null,null,null,"vazia"]
[null,null,null,null,null,null,null,null,null,null,"vazia"]
[null,null,null,null,null,null,null,null,null,null,"vazia"]
[null,null,null,null,null,null,null,null,null,null,"vazia"]
[null,null,null,null,null,null,null,null,null,null,"vazia"]
[null,null,null,null,null,null,null,null,null,null,"vazia"]
[null,null,null,null,null,null,null,null,null,null,"vazia"]
[null,null,null,null,null,null,null,null,null,null,"vazia"]
[null,null,null,null,null,null,null,null,null,null,"vazia"]
[null,null,null,null,null,null,null,null,null,null,"vazia"]
[null,null,null,null,null,null,null,null,null,null,"vazia"]
[null,null,null,null,null,null,null,null,null,null,"vazia"]
[null,null,null,null,null,null,null,null,null,null,"vazia"]
[null,null,null,null,null,null,null,null,null,null,"vazia"]
[null,null,null,null,null,null,null,null,null,null,"vazia"]
[null,null,null,null,null,null,null,null,null,null,"vazia"]
[null,null,null,null,null,null,null,null,null,null,"vazia"]
[null,null,null,null,null,null,null,null,null,null,"vazia"]
[null,null,null,null,null,null,null,null,null,null,"vazia"]
[null,null,null,null,null,null,null,null,null,null,"vazia"]
[null,null,null,null,null,null,null,null,null,null,"vazia"]
[null,null,null,null,null,null,null,null,null,null,"vazia"]
[null,null,null,null,null,null,null,null,null,null,"vazia"]
[null,null,null,null,null,null,null,null,null,null,"vazia"]
[null,null,null,null,null,null,null,null,null,null,"vazia"]
[null,null,null,null,null,null,null,null,null,null,"vazia"]
[null,null,null,null,null,null,null,null,null,null,"vazia"]
[null,null,null,null,null,null,null,null,null,null,"vazia"]
[null,null,null,null,null,null,null,null,null,null,"vazia"]
[null,null,null,null,null,null,null,null,null,null,"vazia"]
[null,null,null,null,null,null,null,null,null,null,"vazia"]
[null,null,null,null,null,null,null,null,null,null,"vazia"]
[null,null,null,null,null,null,null,null,null,null,"vazia"]
[null,null,null,null,null,null,null,null,null,null,"vazia"]
[null,null,null,null,null,null,null,null,null,null,"vazia"]
[null,null,null,null,null,null,null,null,null,null,"vazia"]
[null,null,null,null,null,null,null,null,null,null,"vazia"]
[null,null,null,null,null,null,null,null,null,null,"vazia"]
[null,null,null,null,null,null,null,null,null,null,"vazia"]
[null,null,null,null,null,null,null,null,null,null,"vazia"]
[null,null,null,null,null,null,null,null,null,null,"vazia"]
[null,null,null,null,null,null,null,null,null,null,"vazia"]
[null,null,null,null,null,null,null,null,null,null,"vazia"]
[null,null,null,null,null,null,null,null,null,null,"vazia"]
[null,null,null,null,null,null,null,null,null,null,{"$f":"IF((A290>0),\"X\",\"vazia\")","v":"vazia"}]
[null,null,null,null,null,null,null,null,null,null,"vazia"]
[null,null,null,null,null,null,null,null,null,null,"vazia"]
[null,null,null,null,null,null,null,null,null,null,"vazia"]
[null,null,null,null,null,null,null,null,null,null,"vazia"]
[null,null,null,null,null,null,null,null,null,null,"vazia"]
[null,null,null,null,null,null,null,null,null,null,"vazia"]
[null,null,null,null,null,null,null,null,null,null,"vazia"]
[null,null,null,null,null,null,null,null,null,null,"vazia"]
[null,null,null,null,null,null,null,null,null,null,"vazia"]
[null,null,null,null,null,null,null,null,null,null,"vazia"]
[null,null,null,null,null,null,null,null,null,null,"vazia"]
[null,null,null,null,null,null,null,null,null,null,"vazia"]
[null,null,null,null,null,null,null,null,null,null,"vazia"]
[null,null,null,null,null,null,null,null,null,null,"vazia"]
[null,null,null,null,null,null,null,null,null,null,"vazia"]
[null,null,null,null,null,null,null,null,null,null,"vazia"]
[null,null,null,null,null,null,null,null,null,null,"vazia"]
[null,null,null,null,null,null,null,null,null,null,"vazia"]
[null,null,null,null,null,null,null,null,null,null,"vazia"]
[null,null,null,null,null,null,null,null,null,null,"vazia"]
[null,null,null,null,null,null,null,null,null,null,"vazia"]
[null,null,null,null,null,null,null,null,null,null,"vazia"]
[null,null,null,null,null,null,null,null,null,null,"vazia"]
[null,null,null,null,null,null,null,null,null,null,"vazia"]
[null,null,null,null,null,null,null,null,null,null,"vazia"]
[null,null,null,null,null,null,null,null,null,null,"vazia"]
[null,null,null,null,null,null,null,null,null,null,"vazia"]
[null,null,null,null,null,null,null,null,null,null,"vazia"]
[null,null,null,null,null,null,null,null,null,null,"vazia"]
[null,null,null,null,null,null,null,null,null,null,"vazia"]
[null,null,null,null,null,null,null,null,null,null,"vazia"]
[null,null,null,null,null,null,null,null,null,null,"vazia"]
[null,null,null,null,null,null,null,null,null,null,"vazia"]
[null,null,null,null,null,null,null,null,null,null,"vazia"]
[null,null,null,null,null,null,null,null,null,null,"vazia"]
[null,null,null,null,null,null,null,null,null,null,"vazia"]
[null,null,null,null,null,null,null,null,null,null,"vazia"]
[null,null,null,null,null,null,null,null,null,null,"vazia"]
[null,null,null,null,null,null,null,null,null,null,"vazia"]
[null,null,null,null,null,null,null,null,null,null,"vazia"]
[null,null,null,null,null,null,null,null,null,null,"vazia"]
[null,null,null,null,null,null,null,null,null,null,"vazia"]
[null,null,null,null,null,null,null,null,null,null,"vazia"]
[null,null,null,null,null,null,null,null,null,null,"vazia"]
[null,null,null,null,null,null,null,null,null,null,"vazia"]
[null,null,null,null,null,null,null,null,null,null,"vazia"]
[null,null,null,null,null,null,null,null,null,null,"vazia"]
[null,null,null,null,null,null,null,null,null,null,"vazia"]
[null,null,null,null,null,null,null,null,null,null,"vazia"]
[null,null,null,null,null,null,null,null,null,null,"vazia"]
[null,null,null,null,null,null,null,null,null,null,"vazia"]
[null,null,null,null,null,null,null,null,null,null,"vazia"]
[null,null,null,null,null,null,null,null,null,null,"vazia"]
[null,null,null,null,null,null,null,null,null,null,"vazia"]
[null,null,null,null,null,null,null,null,null,null,"vazia"]
[null,null,null,null,null,null,null,null,null,null,"vazia"]
[null,null,null,null,null,null,null,null,null,null,"vazia"]
[null,null,null,null,null,null,null,null,null,null,"vazia"]
[null,null,null,null,null,null,null,null,null,null,"vazia"]
[null,null,null,null,null,null,null,null,null,null,"vazia"]
[null,null,null,null,null,null,null,null,null,null,"vazia"]
[null,null,null,null,null,null,null,null,null,null,"vazia"]
[null,null,null,null,null,null,null,null,null,null,"vazia"]
[null,null,null,null,null,null,null,null,null,null,{"$f":"IF((A354>0),\"X\",\"vazia\")","v":"vazia"}]
[null,null,null,null,null,null,null,null,null,null,"vazia"]
[null,null,null,null,null,null,null,null,null,null,"vazia"]
[null,null,null,null,null,null,null,null,null,null,"vazia"]
[null,null,null,null,null,null,null,null,null,null,"vazia"]
[null,null,null,null,null,null,null,null,null,null,"vazia"]
[null,null,null,null,null,null,null,null,null,null,"vazia"]
[null,null,null,null,null,null,null,null,null,null,"vazia"]
[null,null,null,null,null,null,null,null,null,null,"vazia"]
[null,null,null,null,null,null,null,null,null,null,"vazia"]
[null,null,null,null,null,null,null,null,null,null,"vazia"]
[null,null,null,null,null,null,null,null,null,null,"vazia"]
[null,null,null,null,null,null,null,null,null,null,"vazia"]
[null,null,null,null,null,null,null,null,null,null,"vazia"]
[null,null,null,null,null,null,null,null,null,null,"vazia"]
[null,null,null,null,null,null,null,null,null,null,"vazia"]
[null,null,null,null,null,null,null,null,null,null,"vazia"]
[null,null,null,null,null,null,null,null,null,null,"vazia"]
[null,null,null,null,null,null,null,null,null,null,"vazia"]
[null,null,null,null,null,null,null,null,null,null,"vazia"]
[null,null,null,null,null,null,null,null,null,null,"vazia"]
[null,null,null,null,null,null,null,null,null,null,"vazia"]
[null,null,null,null,null,null,null,null,null,null,"vazia"]
[null,null,null,null,null,null,null,null,null,null,"vazia"]
[null,null,null,null,null,null,null,null,null,null,"vazia"]
[null,null,null,null,null,null,null,null,null,null,"vazia"]
[null,null,null,null,null,null,null,null,null,null,"vazia"]
[null,null,null,null,null,null,null,null,null,null,"vazia"]
[null,null,null,null,null,null,null,null,null,null,"vazia"]
[null,null,null,null,null,null,null,null,null,null,"vazia"]
[null,null,null,null,null,null,null,null,null,null,"vazia"]
[null,null,null,null,null,null,null,null,null,null,"vazia"]
[null,null,null,null,null,null,null,null,null,null,"vazia"]
[null,null,null,null,null,null,null,null,null,null,"vazia"]
[null,null,null,null,null,null,null,null,null,null,"vazia"]
[null,null,null,null,null,null,null,null,null,null,"vazia"]
[null,null,null,null,null,null,null,null,null,null,"vazia"]
[null,null,null,null,null,null,null,null,null,null,"vazia"]
[null,null,null,null,null,null,null,null,null,null,"vazia"]
[null,null,null,null,null,null,null,null,null,null,"vazia"]
[null,null,null,null,null,null,null,null,null,null,"vazia"]
[null,null,null,null,null,null,null,null,null,null,"vazia"]
[null,null,null,null,null,null,null,null,null,null,{"$f":"IF(($C$31>2),\"X\",\"vazia\")","v":"vazia"}]
[" Lote 03",null,null,null,null,null,null,"Coordenadas UTM",null,null,{"$f":"IF(($C$31>2),\"X\",\"vazia\")","v":"vazia"}]
[" objeto","Descrição da rua (entre trechos)",null,null,null,null,"Sequência","Coordenada X","Coordenada Y",null,"vazia"]
[null,null,null,null,null,null,null,null,null,null,"vazia"]
[null,null,null,null,null,null,null,null,null,null,{"$f":"IF((A400>0),\"X\",\"vazia\")","v":"vazia"}]
[null,null,null,null,null,null,null,null,null,null,"vazia"]
[null,null,null,null,null,null,null,null,null,null,"vazia"]
[null,null,null,null,null,null,null,null,null,null,"vazia"]
[null,null,null,null,null,null,null,null,null,null,"vazia"]
[null,null,null,null,null,null,null,null,null,null,"vazia"]
[null,null,null,null,null,null,null,null,null,null,"vazia"]
[null,null,null,null,null,null,null,null,null,null,"vazia"]
[null,null,null,null,null,null,null,null,null,null,"vazia"]
[null,null,null,null,null,null,null,null,null,null,"vazia"]
[null,null,null,null,null,null,null,null,null,null,"vazia"]
[null,null,null,null,null,null,null,null,null,null,"vazia"]
[null,null,null,null,null,null,null,null,null,null,"vazia"]
[null,null,null,null,null,null,null,null,null,null,"vazia"]
[null,null,null,null,null,null,null,null,null,null,"vazia"]
[null,null,null,null,null,null,null,null,null,null,"vazia"]
[null,null,null,null,null,null,null,null,null,null,"vazia"]
[null,null,null,null,null,null,null,null,null,null,"vazia"]
[null,null,null,null,null,null,null,null,null,null,{"$f":"IF((A418>0),\"X\",\"vazia\")","v":"vazia"}]
[null,null,null,null,null,null,null,null,null,null,"vazia"]
[null,null,null,null,null,null,null,null,null,null,"vazia"]
[null,null,null,null,null,null,null,null,null,null,"vazia"]
[null,null,null,null,null,null,null,null,null,null,"vazia"]
[null,null,null,null,null,null,null,null,null,null,"vazia"]
[null,null,null,null,null,null,null,null,null,null,"vazia"]
[null,null,null,null,null,null,null,null,null,null,"vazia"]
[null,null,null,null,null,null,null,null,null,null,"vazia"]
[null,null,null,null,null,null,null,null,null,null,"vazia"]
[null,null,null,null,null,null,null,null,null,null,"vazia"]
[null,null,null,null,null,null,null,null,null,null,"vazia"]
[null,null,null,null,null,null,null,null,null,null,"vazia"]
[null,null,null,null,null,null,null,null,null,null,"vazia"]
[null,null,null,null,null,null,null,null,null,null,"vazia"]
[null,null,null,null,null,null,null,null,null,null,"vazia"]
[null,null,null,null,null,null,null,null,null,null,"vazia"]
[null,null,null,null,null,null,null,null,null,null,"vazia"]
[null,null,null,null,null,null,null,null,null,null,"vazia"]
[null,null,null,null,null,null,null,null,null,null,"vazia"]
[null,null,null,null,null,null,null,null,null,null,"vazia"]
[null,null,null,null,null,null,null,null,null,null,"vazia"]
[null,null,null,null,null,null,null,null,null,null,"vazia"]
[null,null,null,null,null,null,null,null,null,null,"vazia"]
[null,null,null,null,null,null,null,null,null,null,"vazia"]
[null,null,null,null,null,null,null,null,null,null,"vazia"]
[null,null,null,null,null,null,null,null,null,null,"vazia"]
[null,null,null,null,null,null,null,null,null,null,"vazia"]
[null,null,null,null,null,null,null,null,null,null,"vazia"]
[null,null,null,null,null,null,null,null,null,null,"vazia"]
[null,null,null,null,null,null,null,null,null,null,"vazia"]
[null,null,null,null,null,null,null,null,null,null,"vazia"]
[null,null,null,null,null,null,null,null,null,null,"vazia"]
[null,null,null,null,null,null,null,null,null,null,"vazia"]
[null,null,null,null,null,null,null,null,null,null,"vazia"]
[null,null,null,null,null,null,null,null,null,null,"vazia"]
[null,null,null,null,null,null,null,null,null,null,"vazia"]
[null,null,null,null,null,null,null,null,null,null,"vazia"]
[null,null,null,null,null,null,null,null,null,null,"vazia"]
[null,null,null,null,null,null,null,null,null,null,"vazia"]
[null,null,null,null,null,null,null,null,null,null,"vazia"]
[null,null,null,null,null,null,null,null,null,null,"vazia"]
[null,null,null,null,null,null,null,null,null,null,"vazia"]
[null,null,null,null,null,null,null,null,null,null,"vazia"]
[null,null,null,null,null,null,null,null,null,null,"vazia"]
[null,null,null,null,null,null,null,null,null,null,"vazia"]
[null,null,null,null,null,null,null,null,null,null,"vazia"]
[null,null,null,null,null,null,null,null,null,null,"vazia"]
[null,null,null,null,null,null,null,null,null,null,"vazia"]
[null,null,null,null,null,null,null,null,null,null,"vazia"]
[null,null,null,null,null,null,null,null,null,null,"vazia"]
[null,null,null,null,null,null,null,null,null,null,"vazia"]
[null,null,null,null,null,null,null,null,null,null,"vazia"]
[null,null,null,null,null,null,null,null,null,null,"vazia"]
[null,null,null,null,null,null,null,null,null,null,"vazia"]
[null,null,null,null,null,null,null,null,null,null,"vazia"]
[null,null,null,null,null,null,null,null,null,null,"vazia"]
[null,null,null,null,null,null,null,null,null,null,"vazia"]
[null,null,null,null,null,null,null,null,null,null,"vazia"]
[null,null,null,null,null,null,null,null,null,null,"vazia"]
[null,null,null,null,null,null,null,null,null,null,"vazia"]
[null,null,null,null,null,null,null,null,null,null,"vazia"]
[null,null,null,null,null,null,null,null,null,null,"vazia"]
[null,null,null,null,null,null,null,null,null,null,"vazia"]
[null,null,null,null,null,null,null,null,null,null,{"$f":"IF((A482>0),\"X\",\"vazia\")","v":"vazia"}]
[null,null,null,null,null,null,null,null,null,null,"vazia"]
[null,null,null,null,null,null,null,null,null,null,"vazia"]
[null,null,null,null,null,null,null,null,null,null,"vazia"]
[null,null,null,null,null,null,null,null,null,null,"vazia"]
[null,null,null,null,null,null,null,null,null,null,"vazia"]
[null,null,null,null,null,null,null,null,null,null,"vazia"]
[null,null,null,null,null,null,null,null,null,null,"vazia"]
[null,null,null,null,null,null,null,null,null,null,"vazia"]
[null,null,null,null,null,null,null,null,null,null,"vazia"]
[null,null,null,null,null,null,null,null,null,null,"vazia"]
[null,null,null,null,null,null,null,null,null,null,"vazia"]
[null,null,null,null,null,null,null,null,null,null,"vazia"]
[null,null,null,null,null,null,null,null,null,null,"vazia"]
[null,null,null,null,null,null,null,null,null,null,"vazia"]
[null,null,null,null,null,null,null,null,null,null,"vazia"]
[null,null,null,null,null,null,null,null,null,null,"vazia"]
[null,null,null,null,null,null,null,null,null,null,"vazia"]
[null,null,null,null,null,null,null,null,null,null,"vazia"]
[null,null,null,null,null,null,null,null,null,null,"vazia"]
[null,null,null,null,null,null,null,null,null,null,"vazia"]
[null,null,null,null,null,null,null,null,null,null,"vazia"]
[null,null,null,null,null,null,null,null,null,null,"vazia"]
[null,null,null,null,null,null,null,null,null,null,"vazia"]
[null,null,null,null,null,null,null,null,null,null,"vazia"]
[null,null,null,null,null,null,null,null,null,null,"vazia"]
[null,null,null,null,null,null,null,null,null,null,"vazia"]
[null,null,null,null,null,null,null,null,null,null,"vazia"]
[null,null,null,null,null,null,null,null,null,null,"vazia"]
[null,null,null,null,null,null,null,null,null,null,"vazia"]
[null,null,null,null,null,null,null,null,null,null,"vazia"]
[null,null,null,null,null,null,null,null,null,null,"vazia"]
[null,null,null,null,null,null,null,null,null,null,"vazia"]
[null,null,null,null,null,null,null,null,null,null,"vazia"]
[null,null,null,null,null,null,null,null,null,null,"vazia"]
[null,null,null,null,null,null,null,null,null,null,"vazia"]
[null,null,null,null,null,null,null,null,null,null,"vazia"]
[null,null,null,null,null,null,null,null,null,null,"vazia"]
[null,null,null,null,null,null,null,null,null,null,"vazia"]
[null,null,null,null,null,null,null,null,null,null,"vazia"]
[null,null,null,null,null,null,null,null,null,null,"vazia"]
[null,null,null,null,null,null,null,null,null,null,"vazia"]
[null,null,null,null,null,null,null,null,null,null,"vazia"]
[null,null,null,null,null,null,null,null,null,null,"vazia"]
[null,null,null,null,null,null,null,null,null,null,"vazia"]
[null,null,null,null,null,null,null,null,null,null,"vazia"]
[null,null,null,null,null,null,null,null,null,null,"vazia"]
[null,null,null,null,null,null,null,null,null,null,"vazia"]
[null,null,null,null,null,null,null,null,null,null,"vazia"]
[null,null,null,null,null,null,null,null,null,null,"vazia"]
[null,null,null,null,null,null,null,null,null,null,"vazia"]
[null,null,null,null,null,null,null,null,null,null,"vazia"]
[null,null,null,null,null,null,null,null,null,null,"vazia"]
[null,null,null,null,null,null,null,null,null,null,"vazia"]
[null,null,null,null,null,null,null,null,null,null,"vazia"]
[null,null,null,null,null,null,null,null,null,null,"vazia"]
[null,null,null,null,null,null,null,null,null,null,"vazia"]
[null,null,null,null,null,null,null,null,null,null,"vazia"]
[null,null,null,null,null,null,null,null,null,null,"vazia"]
[null,null,null,null,null,null,null,null,null,null,"vazia"]
[null,null,null,null,null,null,null,null,null,null,"vazia"]
[null,null,null,null,null,null,null,null,null,null,"vazia"]
[null,null,null,null,null,null,null,null,null,null,"vazia"]
[null,null,null,null,null,null,null,null,null,null,"vazia"]
[null,null,null,null,null,null,null,null,null,null,{"$f":"IF((A546>0),\"X\",\"vazia\")","v":"vazia"}]
[null,null,null,null,null,null,null,null,null,null,"vazia"]
[null,null,null,null,null,null,null,null,null,null,"vazia"]
[null,null,null,null,null,null,null,null,null,null,"vazia"]
[null,null,null,null,null,null,null,null,null,null,"vazia"]
[null,null,null,null,null,null,null,null,null,null,"vazia"]
[null,null,null,null,null,null,null,null,null,null,"vazia"]
[null,null,null,null,null,null,null,null,null,null,"vazia"]
[null,null,null,null,null,null,null,null,null,null,"vazia"]
[null,null,null,null,null,null,null,null,null,null,"vazia"]
[null,null,null,null,null,null,null,null,null,null,"vazia"]
[null,null,null,null,null,null,null,null,null,null,"vazia"]
[null,null,null,null,null,null,null,null,null,null,"vazia"]
[null,null,null,null,null,null,null,null,null,null,"vazia"]
[null,null,null,null,null,null,null,null,null,null,"vazia"]
[null,null,null,null,null,null,null,null,null,null,"vazia"]
[null,null,null,null,null,null,null,null,null,null,"vazia"]
[null,null,null,null,null,null,null,null,null,null,"vazia"]
[null,null,null,null,null,null,null,null,null,null,"vazia"]
[null,null,null,null,null,null,null,null,null,null,"vazia"]
[null,null,null,null,null,null,null,null,null,null,"vazia"]
[null,null,null,null,null,null,null,null,null,null,"vazia"]
[null,null,null,null,null,null,null,null,null,null,"vazia"]
[null,null,null,null,null,null,null,null,null,null,"vazia"]
[null,null,null,null,null,null,null,null,null,null,"vazia"]
[null,null,null,null,null,null,null,null,null,null,"vazia"]
[null,null,null,null,null,null,null,null,null,null,"vazia"]
[null,null,null,null,null,null,null,null,null,null,"vazia"]
[null,null,null,null,null,null,null,null,null,null,"vazia"]
[null,null,null,null,null,null,null,null,null,null,"vazia"]
[null,null,null,null,null,null,null,null,null,null,"vazia"]
[null,null,null,null,null,null,null,null,null,null,"vazia"]
[null,null,null,null,null,null,null,null,null,null,{"$f":"IF(($C$31>3),\"X\",\"vazia\")","v":"vazia"}]
[" Lote 04",null,null,null,null,null,null,"Coordenadas UTM",null,null,{"$f":"IF(($C$31>3),\"X\",\"vazia\")","v":"vazia"}]
[" objeto","Descrição da rua (entre trechos)",null,null,null,null,"Sequência","Coordenada X","Coordenada Y",null,"vazia"]
[null,null,null,null,null,null,null,null,null,null,"vazia"]
[null,null,null,null,null,null,null,null,null,null,"vazia"]
[null,null,null,null,null,null,null,null,null,null,{"$f":"IF((A583>0),\"X\",\"vazia\")","v":"vazia"}]
[null,null,null,null,null,null,null,null,null,null,"vazia"]
[null,null,null,null,null,null,null,null,null,null,{"$f":"IF((A585>0),\"X\",\"vazia\")","v":"vazia"}]
[null,null,null,null,null,null,null,null,null,null,{"$f":"IF((A586>0),\"X\",\"vazia\")","v":"vazia"}]
[null,null,null,null,null,null,null,null,null,null,{"$f":"IF((A587>0),\"X\",\"vazia\")","v":"vazia"}]
[null,null,null,null,null,null,null,null,null,null,"vazia"]
[null,null,null,null,null,null,null,null,null,null,"vazia"]
[null,null,null,null,null,null,null,null,null,null,"vazia"]
[null,null,null,null,null,null,null,null,null,null,"vazia"]
[null,null,null,null,null,null,null,null,null,null,"vazia"]
[null,null,null,null,null,null,null,null,null,null,"vazia"]
[null,null,null,null,null,null,null,null,null,null,"vazia"]
[null,null,null,null,null,null,null,null,null,null,"vazia"]
[null,null,null,null,null,null,null,null,null,null,"vazia"]
[null,null,null,null,null,null,null,null,null,null,"vazia"]
[null,null,null,null,null,null,null,null,null,null,"vazia"]
[null,null,null,null,null,null,null,null,null,null,"vazia"]
[null,null,null,null,null,null,null,null,null,null,"vazia"]
[null,null,null,null,null,null,null,null,null,null,"vazia"]
[null,null,null,null,null,null,null,null,null,null,"vazia"]
[null,null,null,null,null,null,null,null,null,null,"vazia"]
[null,null,null,null,null,null,null,null,null,null,"vazia"]
[null,null,null,null,null,null,null,null,null,null,"vazia"]
[null,null,null,null,null,null,null,null,null,null,"vazia"]
[null,null,null,null,null,null,null,null,null,null,"vazia"]
[null,null,null,null,null,null,null,null,null,null,"vazia"]
[null,null,null,null,null,null,null,null,null,null,"vazia"]
[null,null,null,null,null,null,null,null,null,null,{"$f":"IF((A610>0),\"X\",\"vazia\")","v":"vazia"}]
[null,null,null,null,null,null,null,null,null,null,"vazia"]
[null,null,null,null,null,null,null,null,null,null,"vazia"]
[null,null,null,null,null,null,null,null,null,null,"vazia"]
[null,null,null,null,null,null,null,null,null,null,"vazia"]
[null,null,null,null,null,null,null,null,null,null,"vazia"]
[null,null,null,null,null,null,null,null,null,null,"vazia"]
[null,null,null,null,null,null,null,null,null,null,"vazia"]
[null,null,null,null,null,null,null,null,null,null,"vazia"]
[null,null,null,null,null,null,null,null,null,null,"vazia"]
[null,null,null,null,null,null,null,null,null,null,"vazia"]
[null,null,null,null,null,null,null,null,null,null,"vazia"]
[null,null,null,null,null,null,null,null,null,null,"vazia"]
[null,null,null,null,null,null,null,null,null,null,"vazia"]
[null,null,null,null,null,null,null,null,null,null,"vazia"]
[null,null,null,null,null,null,null,null,null,null,"vazia"]
[null,null,null,null,null,null,null,null,null,null,"vazia"]
[null,null,null,null,null,null,null,null,null,null,"vazia"]
[null,null,null,null,null,null,null,null,null,null,"vazia"]
[null,null,null,null,null,null,null,null,null,null,"vazia"]
[null,null,null,null,null,null,null,null,null,null,"vazia"]
[null,null,null,null,null,null,null,null,null,null,"vazia"]
[null,null,null,null,null,null,null,null,null,null,"vazia"]
[null,null,null,null,null,null,null,null,null,null,"vazia"]
[null,null,null,null,null,null,null,null,null,null,"vazia"]
[null,null,null,null,null,null,null,null,null,null,"vazia"]
[null,null,null,null,null,null,null,null,null,null,"vazia"]
[null,null,null,null,null,null,null,null,null,null,"vazia"]
[null,null,null,null,null,null,null,null,null,null,"vazia"]
[null,null,null,null,null,null,null,null,null,null,"vazia"]
[null,null,null,null,null,null,null,null,null,null,"vazia"]
[null,null,null,null,null,null,null,null,null,null,"vazia"]
[null,null,null,null,null,null,null,null,null,null,"vazia"]
[null,null,null,null,null,null,null,null,null,null,"vazia"]
[null,null,null,null,null,null,null,null,null,null,"vazia"]
[null,null,null,null,null,null,null,null,null,null,"vazia"]
[null,null,null,null,null,null,null,null,null,null,"vazia"]
[null,null,null,null,null,null,null,null,null,null,"vazia"]
[null,null,null,null,null,null,null,null,null,null,"vazia"]
[null,null,null,null,null,null,null,null,null,null,"vazia"]
[null,null,null,null,null,null,null,null,null,null,"vazia"]
[null,null,null,null,null,null,null,null,null,null,"vazia"]
[null,null,null,null,null,null,null,null,null,null,"vazia"]
[null,null,null,null,null,null,null,null,null,null,"vazia"]
[null,null,null,null,null,null,null,null,null,null,"vazia"]
[null,null,null,null,null,null,null,null,null,null,"vazia"]
[null,null,null,null,null,null,null,null,null,null,"vazia"]
[null,null,null,null,null,null,null,null,null,null,"vazia"]
[null,null,null,null,null,null,null,null,null,null,"vazia"]
[null,null,null,null,null,null,null,null,null,null,"vazia"]
[null,null,null,null,null,null,null,null,null,null,"vazia"]
[null,null,null,null,null,null,null,null,null,null,"vazia"]
[null,null,null,null,null,null,null,null,null,null,"vazia"]
[null,null,null,null,null,null,null,null,null,null,"vazia"]
[null,null,null,null,null,null,null,null,null,null,"vazia"]
[null,null,null,null,null,null,null,null,null,null,"vazia"]
[null,null,null,null,null,null,null,null,null,null,"vazia"]
[null,null,null,null,null,null,null,null,null,null,"vazia"]
[null,null,null,null,null,null,null,null,null,null,"vazia"]
[null,null,null,null,null,null,null,null,null,null,"vazia"]
[null,null,null,null,null,null,null,null,null,null,"vazia"]
[null,null,null,null,null,null,null,null,null,null,"vazia"]
[null,null,null,null,null,null,null,null,null,null,"vazia"]
[null,null,null,null,null,null,null,null,null,null,"vazia"]
[null,null,null,null,null,null,null,null,null,null,{"$f":"IF((A674>0),\"X\",\"vazia\")","v":"vazia"}]
[null,null,null,null,null,null,null,null,null,null,"vazia"]
[null,null,null,null,null,null,null,null,null,null,"vazia"]
[null,null,null,null,null,null,null,null,null,null,"vazia"]
[null,null,null,null,null,null,null,null,null,null,"vazia"]
[null,null,null,null,null,null,null,null,null,null,"vazia"]
[null,null,null,null,null,null,null,null,null,null,"vazia"]
[null,null,null,null,null,null,null,null,null,null,"vazia"]
[null,null,null,null,null,null,null,null,null,null,"vazia"]
[null,null,null,null,null,null,null,null,null,null,"vazia"]
[null,null,null,null,null,null,null,null,null,null,"vazia"]
[null,null,null,null,null,null,null,null,null,null,"vazia"]
[null,null,null,null,null,null,null,null,null,null,"vazia"]
[null,null,null,null,null,null,null,null,null,null,"vazia"]
[null,null,null,null,null,null,null,null,null,null,"vazia"]
[null,null,null,null,null,null,null,null,null,null,"vazia"]
[null,null,null,null,null,null,null,null,null,null,"vazia"]
[null,null,null,null,null,null,null,null,null,null,"vazia"]
[null,null,null,null,null,null,null,null,null,null,"vazia"]
[null,null,null,null,null,null,null,null,null,null,"vazia"]
[null,null,null,null,null,null,null,null,null,null,"vazia"]
[null,null,null,null,null,null,null,null,null,null,"vazia"]
[null,null,null,null,null,null,null,null,null,null,"vazia"]
[null,null,null,null,null,null,null,null,null,null,"vazia"]
[null,null,null,null,null,null,null,null,null,null,"vazia"]
[null,null,null,null,null,null,null,null,null,null,"vazia"]
[null,null,null,null,null,null,null,null,null,null,"vazia"]
[null,null,null,null,null,null,null,null,null,null,"vazia"]
[null,null,null,null,null,null,null,null,null,null,"vazia"]
[null,null,null,null,null,null,null,null,null,null,"vazia"]
[null,null,null,null,null,null,null,null,null,null,"vazia"]
[null,null,null,null,null,null,null,null,null,null,"vazia"]
[null,null,null,null,null,null,null,null,null,null,"vazia"]
[null,null,null,null,null,null,null,null,null,null,"vazia"]
[null,null,null,null,null,null,null,null,null,null,"vazia"]
[null,null,null,null,null,null,null,null,null,null,"vazia"]
[null,null,null,null,null,null,null,null,null,null,"vazia"]
[null,null,null,null,null,null,null,null,null,null,"vazia"]
[null,null,null,null,null,null,null,null,null,null,"vazia"]
[null,null,null,null,null,null,null,null,null,null,"vazia"]
[null,null,null,null,null,null,null,null,null,null,"vazia"]
[null,null,null,null,null,null,null,null,null,null,"vazia"]
[null,null,null,null,null,null,null,null,null,null,"vazia"]
[null,null,null,null,null,null,null,null,null,null,"vazia"]
[null,null,null,null,null,null,null,null,null,null,"vazia"]
[null,null,null,null,null,null,null,null,null,null,"vazia"]
[null,null,null,null,null,null,null,null,null,null,"vazia"]
[null,null,null,null,null,null,null,null,null,null,"vazia"]
[null,null,null,null,null,null,null,null,null,null,"vazia"]
[null,null,null,null,null,null,null,null,null,null,"vazia"]
[null,null,null,null,null,null,null,null,null,null,"vazia"]
[null,null,null,null,null,null,null,null,null,null,"vazia"]
[null,null,null,null,null,null,null,null,null,null,"vazia"]
[null,null,null,null,null,null,null,null,null,null,"vazia"]
[null,null,null,null,null,null,null,null,null,null,"vazia"]
[null,null,null,null,null,null,null,null,null,null,"vazia"]
[null,null,null,null,null,null,null,null,null,null,"vazia"]
[null,null,null,null,null,null,null,null,null,null,"vazia"]
[null,null,null,null,null,null,null,null,null,null,"vazia"]
[null,null,null,null,null,null,null,null,null,null,"vazia"]
[null,null,null,null,null,null,null,null,null,null,"vazia"]
[null,null,null,null,null,null,null,null,null,null,"vazia"]
[null,null,null,null,null,null,null,null,null,null,"vazia"]
[null,null,null,null,null,null,null,null,null,null,"vazia"]
[null,null,null,null,null,null,null,null,null,null,{"$f":"IF((A738>0),\"X\",\"vazia\")","v":"vazia"}]
[null,null,null,null,null,null,null,null,null,null,"vazia"]
[null,null,null,null,null,null,null,null,null,null,"vazia"]
[null,null,null,null,null,null,null,null,null,null,"vazia"]
[null,null,null,null,null,null,null,null,null,null,"vazia"]
[null,null,null,null,null,null,null,null,null,null,"vazia"]
[null,null,null,null,null,null,null,null,null,null,"vazia"]
[null,null,null,null,null,null,null,null,null,null,"vazia"]
[null,null,null,null,null,null,null,null,null,null,"vazia"]
[null,null,null,null,null,null,null,null,null,null,"vazia"]
[null,null,null,null,null,null,null,null,null,null,"vazia"]
[null,null,null,null,null,null,null,null,null,null,"vazia"]
[null,null,null,null,null,null,null,null,null,null,"vazia"]
[null,null,null,null,null,null,null,null,null,null,"vazia"]
[null,null,null,null,null,null,null,null,null,null,"vazia"]
[null,null,null,null,null,null,null,null,null,null,{"$f":"IF((A753>0),\"X\",\"vazia\")","v":"vazia"}]
[null,null,null,null,null,null,null,null,null,null,"vazia"]
[null,null,null,null,null,null,null,null,null,null,"vazia"]
[null,null,null,null,null,null,null,null,null,null,"vazia"]
[null,null,null,null,null,null,null,null,null,null,"vazia"]
[null,null,null,null,null,null,null,null,null,null,"vazia"]
[null,null,null,null,null,null,null,null,null,null,"vazia"]
["Ꙭ ALERTA →","ANTES DE PROSSEGUIR, DIGITE O Nº DE LOTES DO PROJETO.",null,null,null,null,null,null,null,null,{"$f":"IF($C$31>0,\"VAZIA\",\"X\")","v":"VAZIA"}]
[null,null,null,null,null,null,null,null,null,null,"X"]
["04. ÁREA/ QUANTIDADE",null,null,null,null,null,null,null,null,null,"X"]
["Área/Quantidade TOTAL:",null,{"$f":"SUM(C765:D768)","v":10892.7},null,null,null,null,"Extensão TOTAL:",{"$f":"SUM(I765:I768)","v":0},null,"X"]
["Área/Quantidade LOTE 1:",null,10892.7,null,null,null,null,"Extensão:",null,null,{"$f":"IF($C$31>0,\"x\",\"vazia\")","v":"x"}]
["Área/Quantidade LOTE 2:",null,null,null,null,null,null,"Extensão:",null,null,{"$f":"IF(($C$31>1),\"X\",\"vazia\")","v":"vazia"}]
["Área/Quantidade LOTE 3:",null,null,null,null,null,null,"Extensão:",null,null,{"$f":"IF(($C$31>2),\"X\",\"vazia\")","v":"vazia"},null,null,null,null,null,null,null,null,null,null,null,null,null,null,null,null,null,null,null,null,null,null,null,null,null,null,null,null,null,null,null,null,null,null,null,null,null,null,null,null,null,null,null,null,null,null,null,null,null,null,null,null,null,null,null,null,null,null,null,null,null,null,null,null,null,null,null,null,null,null,null,null,null,null,null,null,null,null,null,null,null,null,null,null,1300000]
["Área/Quantidade LOTE 4:",null,null,null,null,null,null,"Extensão:",null,null,{"$f":"IF(($C$31>3),\"X\",\"vazia\")","v":"vazia"}]
[null,null,null,null,null,null,null,null,null,null,"X"]
["05. CUSTOS E CRONOGRAMA",null,null,null,null,null,null,null,null,null,"X"]
[null,null,null,null,null,null,null,null,null,null,"X"]
["Valor do Projeto Aprovado - TOTAL:",null,{"$f":"SUM(C773:D776)","v":0},null,null,null,null,"Contrapartida:",{"$f":"SUM(I773:I776)","v":0},null,"X"]
["Valor do Projeto Aprovado - LOTE1:",null,null,null,null,null,null,"Contrapartida:",null,null,{"$f":"IF($C$31>0,\"x\",\"vazia\")","v":"x"}]
["Valor do Projeto Aprovado - LOTE2:",null,null,null,null,null,null,"Contrapartida:",null,null,{"$f":"IF(($C$31>1),\"X\",\"vazia\")","v":"vazia"}]
["Valor do Projeto Aprovado - LOTE3:",null,null,null,null,null,null,"Contrapartida:",null,null,{"$f":"IF(($C$31>2),\"X\",\"vazia\")","v":"vazia"}]
["Valor do Projeto Aprovado - LOTE4:",null,null,null,null,null,null,"Contrapartida:",null,null,{"$f":"IF(($C$31>3),\"X\",\"vazia\")","v":"vazia"}]
[null,null,null,null,null,null,null,null,null,null,"X"]
["Cronograma:",10,"meses",null,null,null,null,null,null,null,"X"]
[null,null,null,null,null,null,null,null,null,null,"X"]
["06. POPULAÇÃO BENEFICIADA",null,null,null,null,null,null,null,null,null,"X"]
[null,null,null,null,null,null,null,null,null,null,"X"]
[null,"habitantes",null,null,null,null,null,null,null,null,"X"]
[null,null,null,null,null,null,null,null,null,null,"X"]
["07. AVALIAÇÃO ECONÔMICA",null,null,null,null,null,null,null,null,null,"X"]
[]
["Mínimo custo. Planilha de serviços e preços elaborada pelo município com base em tabelas oficiais, cotações de mercado e composições de custo."]
[]
["08. AVALIAÇÃO FINANCEIRA"]
[]
[{"$f":"(IF(E10=\"PAM\",\"Obra com recursos de Transferência Voluntária (Fundo Perdido), Convênio  \"&H10&\" –  SECID\",\"Obra com recursos de Operação de Crédito – \"&E10))&(IF((H12>0),\"  e complementação de valor em contrapartida Municipal.\",))","v":"Obra com recursos de Transferência Voluntária (Fundo Perdido), Convênio   –  SECID"}]
[]
["09. DOCUMENTAÇÃO EM ANEXO"]
["- PARECER URBANÍSTICO"]
["- QUESTIONÁRIO AMBIENTAL"]
[]
[]
[]
[]
[{"$f":"B6","v":"CAFEARA"},null,{"$f":"TODAY()","v":"2023-07-14"}]
[]
[]
[null,null,null,null,null,null,null,"Nelson Macedo Novaes"]
[null,null,null,null,null,null,null,"Engenheiro Civil"]
[null,null,null,null,null,null,null,"CREA PR-14.941/D"]

{"sheet":"PARECER URBANÍSTICO","index":2,"n_rows":2852,"n_cols":14,"rows_kept":2852,"cut":false,"hidden":false,"merged":[[38,2,38,9],[39,2,39,9],[214,2,214,9],[215,2,215,9],[1580,2,1580,3],[1580,5,1580,7],[1580,8,1580,9],[1577,2,1577,3],[1577,5,1577,7],[1577,8,1577,9],[1578,2,1578,3],[1578,5,1578,7],[1578,8,1578,9],[1579,2,1579,3],[1579,5,1579,7],[1579,8,1579,9],[1574,2,1574,3],[1574,5,1574,7],[1574,8,1574,9],[1575,2,1575,3],[1575,5,1575,7],[1564,2,1564,3],[1564,5,1564,7],[1564,8,1564,9],[1565,2,1565,3],[1565,5,1565,7],[1565,8,1565,9],[1558,2,1558,3],[1558,5,1558,7],[1558,8,1558,9],[1561,2,1561,3],[1561,5,1561,7],[1589,2,1589,3],[1589,5,1589,7],[1589,8,1589,9],[1590,2,1590,3],[1590,5,1590,7],[1590,8,1590,9],[1591,2,1591,3],[1591,5,1591,7],[1591,8,1591,9],[1594,2,1594,3],[1594,5,1594,7],[1576,5,1576,7],[1576,8,1576,9],[1569,2,1569,3],[1569,5,1569,7],[1569,8,1569,9],[1570,2,1570,3],[1570,5,1570,7],[1570,8,1570,9],[1571,2,1571,3],[1571,5,1571,7],[1571,8,1571,9],[1581,2,1581,3],[1581,5,1581,7],[1581,8,1581,9],[1575,8,1575,9],[1576,2,1576,3],[1584,2,1584,3],[1584,5,1584,7],[1584,8,1584,9],[1561,8,1561,9],[1559,2,1559,3],[1559,5,1559,7],[1559,8,1559,9],[1560,2,1560,3],[1560,5,1560,7],[1560,8,1560,9],[1588,5,1588,7],[1588,8,1588,9],[1566,2,1566,3],[1566,5,1566,7],[1566,8,1566,9],[1567,2,1567,3],[1567,5,1567,7],[1567,8,1567,9],[1568,2,1568,3],[1568,5,1568,7],[1568,8,1568,9],[1586,2,1586,3],[1586,5,1586,7],[1586,8,1586,9],[1587,2,1587,3],[1587,5,1587,7],[1587,8,1587,9],[1588,2,1588,3],[1585,2,1585,3],[1585,5,1585,7],[1585,8,1585,9],[1557,2,1557,3],[1557,5,1557,7],[1557,8,1557,9],[1550,2,1550,3],[1547,2,1547,3],[1547,5,1547,7],[1547,8,1547,9],[1548,2,1548,3],[1548,5,1548,7],[1548,8,1548,9],[1544,8,1544,9],[1545,2,1545,3],[1545,5,1545,7],[1545,8,1545,9],[1546,2,1546,3],[1546,5,1546,7],[1546,8,1546,9],[1550,5,1550,7],[1550,8,1550,9],[1551,2,1551,3],[1551,5,1551,7],[1551,8,1551,9],[1554,2,1554,3],[1554,5,1554,7],[1554,8,1554,9],[1555,2,1555,3],[1555,5,1555,7],[1555,8,1555,9],[1556,2,1556,3],[1556,5,1556,7],[1556,8,1556,9],[1536,2,1536,3],[1536,5,1536,7],[1536,8,1536,9],[1537,2,1537,3],[1537,5,1537,7],[1537,8,1537,9],[1538,2,1538,3],[1538,5,1538,7],[1538,8,1538,9],[1549,2,1549,3],[1549,5,1549,7],[1549,8,1549,9],[1544,2,1544,3],[1544,5,1544,7],[1539,2,1539,3],[1539,5,1539,7],[1539,8,1539,9],[1540,2,1540,3],[1540,5,1540,7],[1540,8,1540,9],[1541,2,1541,3],[1541,5,1541,7],[1541,8,1541,9],[1531,2,1531,3],[1531,5,1531,7],[1531,8,1531,9],[1534,2,1534,3],[1534,5,1534,7],[1534,8,1534,9],[1535,2,1535,3],[1535,5,1535,7],[1535,8,1535,9],[1528,2,1528,3],[1528,5,1528,7],[1528,8,1528,9],[1529,2,1529,3],[1529,5,1529,7],[1529,8,1529,9],[1530,2,1530,3],[1530,5,1530,7],[1530,8,1530,9],[1525,2,1525,3],[1525,5,1525,7],[1525,8,1525,9],[1526,2,1526,3],[1526,5,1526,7],[1526,8,1526,9],[1527,2,1527,3],[1527,5,1527,7],[1527,8,1527,9],[1520,2,1520,3],[1520,5,1520,7],[1520,8,1520,9],[1521,2,1521,3],[1521,5,1521,7],[1521,8,1521,9],[1524,2,1524,3],[1524,5,1524,7],[1524,8,1524,9],[1517,2,1517,3],[1517,5,1517,7],[1517,8,1517,9],[1518,2,1518,3],[1518,5,1518,7],[1518,8,1518,9],[1519,2,1519,3],[1519,5,1519,7],[1519,8,1519,9],[1514,2,1514,3],[1514,5,1514,7],[1514,8,1514,9],[1515,2,1515,3],[1515,5,1515,7],[1515,8,1515,9],[1516,2,1516,3],[1516,5,1516,7],[1516,8,1516,9],[1509,2,1509,3],[1509,5,1509,7],[1509,8,1509,9],[1510,2,1510,3],[1510,5,1510,7],[1510,8,1510,9],[1511,2,1511,3],[1511,5,1511,7],[1511,8,1511,9],[1506,2,1506,3],[1506,5,1506,7],[1506,8,1506,9],[1507,2,1507,3],[1507,5,1507,7],[1507,8,1507,9],[1508,2,1508,3],[1508,5,1508,7],[1508,8,1508,9],[1501,2,1501,3],[1501,5,1501,7],[1501,8,1501,9],[1504,2,1504,3],[1504,5,1504,7],[1504,8,1504,9],[1505,2,1505,3],[1505,5,1505,7],[1505,8,1505,9],[1498,2,1498,3],[1498,5,1498,7],[1498,8,1498,9],[1499,2,1499,3],[1499,5,1499,7],[1499,8,1499,9],[1500,2,1500,3],[1500,5,1500,7],[1500,8,1500,9],[1495,2,1495,3],[1495,5,1495,7],[1495,8,1495,9],[1496,2,1496,3],[1496,5,1496,7],[1496,8,1496,9],[1497,2,1497,3],[1497,5,1497,7],[1497,8,1497,9],[1490,2,1490,3],[1490,5,1490,7],[1490,8,1490,9],[1491,2,1491,3],[1491,5,1491,7],[1491,8,1491,9],[1494,2,1494,3],[1494,5,1494,7],[1494,8,1494,9],[1487,2,1487,3],[1487,5,1487,7],[1487,8,1487,9],[1488,2,1488,3],[1488,5,1488,7],[1488,8,1488,9],[1489,2,1489,3],[1489,5,1489,7],[1489,8,1489,9],[1484,2,1484,3],[1484,5,1484,7],[1484,8,1484,9],[1485,2,1485,3],[1485,5,1485,7],[1485,8,1485,9],[1486,2,1486,3],[1486,5,1486,7],[1486,8,1486,9],[1479,2,1479,3],[1479,5,1479,7],[1479,8,1479,9],[1480,2,1480,3],[1480,5,1480,7],[1480,8,1480,9],[1481,2,1481,3],[1481,5,1481,7],[1481,8,1481,9],[1476,2,1476,3],[1476,5,1476,7],[1476,8,1476,9],[1477,2,1477,3],[1477,5,1477,7],[1477,8,1477,9],[1478,2,1478,3],[1478,5,1478,7],[1478,8,1478,9],[1471,2,1471,3],[1471,5,1471,7],[1471,8,1471,9],[1474,2,1474,3],[1474,5,1474,7],[1474,8,1474,9],[1475,2,1475,3],[1475,5,1475,7],[1475,8,1475,9],[1468,2,1468,3],[1468,5,1468,7],[1468,8,1468,9],[1469,2,1469,3],[1469,5,1469,7],[1469,8,1469,9],[1470,2,1470,3],[1470,5,1470,7],[1470,8,1470,9],[1465,2,1465,3],[1465,5,1465,7],[1465,8,1465,9],[1466,2,1466,3],[1466,5,1466,7],[1466,8,1466,9],[1467,2,1467,3],[1467,5,1467,7],[1467,8,1467,9],[1460,2,1460,3],[1460,5,1460,7],[1460,8,1460,9],[1461,2,1461,3],[1461,5,1461,7],[1461,8,1461,9],[1464,2,1464,3],[1464,5,1464,7],[1464,8,1464,9],[1457,2,1457,3],[1457,5,1457,7],[1457,8,1457,9],[1458,2,1458,3],[1458,5,1458,7],[1458,8,1458,9],[1459,2,1459,3],[1459,5,1459,7],[1459,8,1459,9],[1454,2,1454,3],[1454,5,1454,7],[1454,8,1454,9],[1455,2,1455,3],[1455,5,1455,7],[1455,8,1455,9],[1456,2,1456,3],[1456,5,1456,7],[1456,8,1456,9],[1449,2,1449,3],[1449,5,1449,7],[1449,8,1449,9],[1450,2,1450,3],[1450,5,1450,7],[1450,8,1450,9],[1451,2,1451,3],[1451,5,1451,7],[1451,8,1451,9],[1446,2,1446,3],[1446,5,1446,7],[1446,8,1446,9],[1447,2,1447,3],[1447,5,1447,7],[1447,8,1447,9],[1448,2,1448,3],[1448,5,1448,7],[1448,8,1448,9],[1441,2,1441,3],[1441,5,1441,7],[1441,8,1441,9],[1444,2,1444,3],[1444,5,1444,7],[1444,8,1444,9],[1445,2,1445,3],[1445,5,1445,7],[1445,8,1445,9],[1438,2,1438,3],[1438,5,1438,7],[1438,8,1438,9],[1439,2,1439,3],[1439,5,1439,7],[1439,8,1439,9],[1440,2,1440,3],[1440,5,1440,7],[1440,8,1440,9],[1435,2,1435,3],[1435,5,1435,7],[1435,8,1435,9],[1436,2,1436,3],[1436,5,1436,7],[1436,8,1436,9],[1437,2,1437,3],[1437,5,1437,7],[1437,8,1437,9],[1430,2,1430,3],[1430,5,1430,7],[1430,8,1430,9],[1431,2,1431,3],[1431,5,1431,7],[1431,8,1431,9],[1434,2,1434,3],[1434,5,1434,7],[1434,8,1434,9],[1427,2,1427,3],[1427,5,1427,7],[1427,8,1427,9],[1428,2,1428,3],[1428,5,1428,7],[1428,8,1428,9],[1429,2,1429,3],[1429,5,1429,7],[1429,8,1429,9],[1424,2,1424,3],[1424,5,1424,7],[1424,8,1424,9],[1425,2,1425,3],[1425,5,1425,7],[1425,8,1425,9],[1426,2,1426,3],[1426,5,1426,7],[1426,8,1426,9],[1419,2,1419,3],[1419,5,1419,7],[1419,8,1419,9],[1420,2,1420,3],[1420,5,1420,7],[1420,8,1420,9],[1421,2,1421,3],[1421,5,1421,7],[1421,8,1421,9],[1416,2,1416,3],[1416,5,1416,7],[1416,8,1416,9],[1417,2,1417,3],[1417,5,1417,7],[1417,8,1417,9],[1418,2,1418,3],[1418,5,1418,7],[1418,8,1418,9],[1411,2,1411,3],[1411,5,1411,7],[1411,8,1411,9],[1414,2,1414,3],[1414,5,1414,7],[1414,8,1414,9],[1415,2,1415,3],[1415,5,1415,7],[1415,8,1415,9],[1408,2,1408,3],[1408,5,1408,7],[1408,8,1408,9],[1409,2,1409,3],[1409,5,1409,7],[1409,8,1409,9],[1410,2,1410,3],[1410,5,1410,7],[1410,8,1410,9],[1405,2,1405,3],[1405,5,1405,7],[1405,8,1405,9],[1406,2,1406,3],[1406,5,1406,7],[1406,8,1406,9],[1407,2,1407,3],[1407,5,1407,7],[1407,8,1407,9],[1400,2,1400,3],[1400,5,1400,7],[1400,8,1400,9],[1401,2,1401,3],[1401,5,1401,7],[1401,8,1401,9],[1404,2,1404,3],[1404,5,1404,7],[1404,8,1404,9],[1397,2,1397,3],[1397,5,1397,7],[1397,8,1397,9],[1398,2,1398,3],[1398,5,1398,7],[1398,8,1398,9],[1399,2,1399,3],[1399,5,1399,7],[1399,8,1399,9],[1394,2,1394,3],[1394,5,1394,7],[1394,8,1394,9],[1395,2,1395,3],[1395,5,1395,7],[1395,8,1395,9],[1396,2,1396,3],[1396,5,1396,7],[1396,8,1396,9],[1389,2,1389,3],[1389,5,1389,7],[1389,8,1389,9],[1390,2,1390,3],[1390,5,1390,7],[1390,8,1390,9],[1391,2,1391,3],[1391,5,1391,7],[1391,8,1391,9],[1386,2,1386,3],[1386,5,1386,7],[1386,8,1386,9],[1387,2,1387,3],[1387,5,1387,7],[1387,8,1387,9],[1388,2,1388,3],[1388,5,1388,7],[1388,8,1388,9],[1381,2,1381,3],[1381,5,1381,7],[1381,8,1381,9],[1384,2,1384,3],[1384,5,1384,7],[1384,8,1384,9],[1385,2,1385,3],[1385,5,1385,7],[1385,8,1385,9],[1378,2,1378,3],[1378,5,1378,7],[1378,8,1378,9],[1379,2,1379,3],[1379,5,1379,7],[1379,8,1379,9],[1380,2,1380,3],[1380,5,1380,7],[1380,8,1380,9],[1375,2,1375,3],[1375,5,1375,7],[1375,8,1375,9],[1376,2,1376,3],[1376,5,1376,7],[1376,8,1376,9],[1377,2,1377,3],[1377,5,1377,7],[1377,8,1377,9],[1370,2,1370,3],[1370,5,1370,7],[1370,8,1370,9],[1371,2,1371,3],[1371,5,1371,7],[1371,8,1371,9],[1374,2,1374,3],[1374,5,1374,7],[1374,8,1374,9],[1367,2,1367,3],[1367,5,1367,7],[1367,8,1367,9],[1368,2,1368,3],[1368,5,1368,7],[1368,8,1368,9],[1369,2,1369,3],[1369,5,1369,7],[1369,8,1369,9],[1364,2,1364,3],[1364,5,1364,7],[1364,8,1364,9],[1365,2,1365,3],[1365,5,1365,7],[1365,8,1365,9],[1366,2,1366,3],[1366,5,1366,7],[1366,8,1366,9],[1359,2,1359,3],[1359,5,1359,7],[1359,8,1359,9],[1360,2,1360,3],[1360,5,1360,7],[1360,8,1360,9],[1361,2,1361,3],[1361,5,1361,7],[1361,8,1361,9],[1356,2,1356,3],[1356,5,1356,7],[1356,8,1356,9],[1357,2,1357,3],[1357,5,1357,7],[1357,8,1357,9],[1358,2,1358,3],[1358,5,1358,7],[1358,8,1358,9],[1351,2,1351,3],[1351,5,1351,7],[1351,8,1351,9],[1354,2,1354,3],[1354,5,1354,7],[1354,8,1354,9],[1355,2,1355,3],[1355,5,1355,7],[1355,8,1355,9],[1348,2,1348,3],[1348,5,1348,7],[1348,8,1348,9],[1349,2,1349,3],[1349,5,1349,7],[1349,8,1349,9],[1350,2,1350,3],[1350,5,1350,7],[1350,8,1350,9],[1345,2,1345,3],[1345,5,1345,7],[1345,8,1345,9],[1346,2,1346,3],[1346,5,1346,7],[1346,8,1346,9],[1347,2,1347,3],[1347,5,1347,7],[1347,8,1347,9],[1340,2,1340,3],[1340,5,1340,7],[1340,8,1340,9],[1341,2,1341,3],[1341,5,1341,7],[1341,8,1341,9],[1344,2,1344,3],[1344,5,1344,7],[1344,8,1344,9],[1337,2,1337,3],[1337,5,1337,7],[1337,8,1337,9],[1338,2,1338,3],[1338,5,1338,7],[1338,8,1338,9],[1339,2,1339,3],[1339,5,1339,7],[1339,8,1339,9],[1334,2,1334,3],[1334,5,1334,7],[1334,8,1334,9],[1335,2,1335,3],[1335,5,1335,7],[1335,8,1335,9],[1336,2,1336,3],[1336,5,1336,7],[1336,8,1336,9],[1329,2,1329,3],[1329,5,1329,7],[1329,8,1329,9],[1330,2,1330,3],[1330,5,1330,7],[1330,8,1330,9],[1331,2,1331,3],[1331,5,1331,7],[1331,8,1331,9],[1326,2,1326,3],[1326,5,1326,7],[1326,8,1326,9],[1327,2,1327,3],[1327,5,1327,7],[1327,8,1327,9],[1328,2,1328,3],[1328,5,1328,7],[1328,8,1328,9],[1321,2,1321,3],[1321,5,1321,7],[1321,8,1321,9],[1324,2,1324,3],[1324,5,1324,7],[1324,8,1324,9],[1325,2,1325,3],[1325,5,1325,7],[1325,8,1325,9],[1318,2,1318,3],[1318,5,1318,7],[1318,8,1318,9],[1319,2,1319,3],[1319,5,1319,7],[1319,8,1319,9],[1320,2,1320,3],[1320,5,1320,7],[1320,8,1320,9],[1315,2,1315,3],[1315,5,1315,7],[1315,8,1315,9],[1316,2,1316,3],[1316,5,1316,7],[1316,8,1316,9],[1317,2,1317,3],[1317,5,1317,7],[1317,8,1317,9],[1310,2,1310,3],[1310,5,1310,7],[1310,8,1310,9],[1311,2,1311,3],[1311,5,1311,7],[1311,8,1311,9],[1314,2,1314,3],[1314,5,1314,7],[1314,8,1314,9],[1307,2,1307,3],[1307,5,1307,7],[1307,8,1307,9],[1308,2,1308,3],[1308,5,1308,7],[1308,8,1308,9],[1309,2,1309,3],[1309,5,1309,7],[1309,8,1309,9],[1304,2,1304,3],[1304,5,1304,7],[1304,8,1304,9],[1305,2,1305,3],[1305,5,1305,7],[1305,8,1305,9],[1306,2,1306,3],[1306,5,1306,7],[1306,8,1306,9],[1289,5,1289,7],[1289,8,1289,9],[1290,2,1290,3],[1290,5,1290,7],[1290,8,1290,9],[1299,2,1299,3],[1299,5,1299,7],[1299,8,1299,9],[1300,2,1300,3],[1300,5,1300,7],[1300,8,1300,9],[1301,2,1301,3],[1301,5,1301,7],[1301,8,1301,9],[1296,2,1296,3],[1296,5,1296,7],[1296,8,1296,9],[1297,2,1297,3],[1297,5,1297,7],[1297,8,1297,9],[1298,2,1298,3],[1298,5,1298,7],[1298,8,1298,9],[1079,2,1079,3],[1079,5,1079,7],[1079,8,1079,9],[1080,2,1080,3],[1080,5,1080,7],[1080,8,1080,9],[1284,2,1284,3],[1284,5,1284,7],[1284,8,1284,9],[1089,2,1089,3],[1089,5,1089,7],[1089,8,1089,9],[1090,2,1090,3],[1090,5,1090,7],[1090,8,1090,9],[1093,2,1093,3],[1093,5,1093,7],[1093,8,1093,9],[1094,2,1094,3],[1094,5,1094,7],[1094,8,1094,9],[1095,2,1095,3],[1083,2,1083,3],[1088,2,1088,3],[1088,5,1088,7],[1088,8,1088,9],[1095,5,1095,7],[1095,8,1095,9],[1096,2,1096,3],[1096,5,1096,7],[1096,8,1096,9],[1083,5,1083,7],[1076,2,1076,3],[1076,5,1076,7],[1076,8,1076,9],[1077,2,1077,3],[1077,5,1077,7],[1077,8,1077,9],[1078,2,1078,3],[1078,5,1078,7],[1078,8,1078,9],[1073,2,1073,3],[1073,5,1073,7],[1073,8,1073,9],[1074,2,1074,3],[1074,5,1074,7],[1074,8,1074,9],[1075,2,1075,3],[1075,5,1075,7],[1075,8,1075,9],[1068,2,1068,3],[1068,5,1068,7],[1068,8,1068,9],[1069,2,1069,3],[1069,5,1069,7],[1069,8,1069,9],[1070,2,1070,3],[1070,5,1070,7],[1070,8,1070,9],[1065,2,1065,3],[1065,5,1065,7],[1065,8,1065,9],[1066,2,1066,3],[1066,5,1066,7],[1066,8,1066,9],[1067,2,1067,3],[1067,5,1067,7],[1067,8,1067,9],[1060,2,1060,3],[1060,5,1060,7],[1060,8,1060,9],[1063,2,1063,3],[1063,5,1063,7],[1063,8,1063,9],[1064,2,1064,3],[1064,5,1064,7],[1064,8,1064,9],[1057,2,1057,3],[1057,5,1057,7],[1057,8,1057,9],[1058,2,1058,3],[1058,5,1058,7],[1058,8,1058,9],[1059,2,1059,3],[1059,5,1059,7],[1059,8,1059,9],[1054,2,1054,3],[1054,5,1054,7],[1054,8,1054,9],[1055,2,1055,3],[1055,5,1055,7],[1055,8,1055,9],[1056,2,1056,3],[1056,5,1056,7],[1056,8,1056,9],[1049,2,1049,3],[1049,5,1049,7],[1049,8,1049,9],[1050,2,1050,3],[1050,5,1050,7],[1050,8,1050,9],[1053,2,1053,3],[1053,5,1053,7],[1053,8,1053,9],[1046,2,1046,3],[1046,5,1046,7],[1046,8,1046,9],[1047,2,1047,3],[1047,5,1047,7],[1047,8,1047,9],[1048,2,1048,3],[1048,5,1048,7],[1048,8,1048,9],[1043,2,1043,3],[1043,5,1043,7],[1043,8,1043,9],[1044,2,1044,3],[1044,5,1044,7],[1044,8,1044,9],[1045,2,1045,3],[1045,5,1045,7],[1045,8,1045,9],[1038,2,1038,3],[1038,5,1038,7],[1038,8,1038,9],[1039,2,1039,3],[1039,5,1039,7],[1039,8,1039,9],[1040,2,1040,3],[1040,5,1040,7],[1040,8,1040,9],[1035,2,1035,3],[1035,5,1035,7],[1035,8,1035,9],[1036,2,1036,3],[1036,5,1036,7],[1036,8,1036,9],[1037,2,1037,3],[1037,5,1037,7],[1037,8,1037,9],[1030,2,1030,3],[1030,5,1030,7],[1030,8,1030,9],[1033,2,1033,3],[1033,5,1033,7],[1033,8,1033,9],[1034,2,1034,3],[1034,5,1034,7],[1034,8,1034,9],[1027,2,1027,3],[1027,5,1027,7],[1027,8,1027,9],[1028,2,1028,3],[1028,5,1028,7],[1028,8,1028,9],[1029,2,1029,3],[1029,5,1029,7],[1029,8,1029,9],[1024,2,1024,3],[1024,5,1024,7],[1024,8,1024,9],[1025,2,1025,3],[1025,5,1025,7],[1025,8,1025,9],[1026,2,1026,3],[1026,5,1026,7],[1026,8,1026,9],[1019,2,1019,3],[1019,5,1019,7],[1019,8,1019,9],[1020,2,1020,3],[1020,5,1020,7],[1020,8,1020,9],[1023,2,1023,3],[1023,5,1023,7],[1023,8,1023,9],[1016,2,1016,3],[1016,5,1016,7],[1016,8,1016,9],[1017,2,1017,3],[1017,5,1017,7],[1017,8,1017,9],[1018,2,1018,3],[1018,5,1018,7],[1018,8,1018,9],[1013,2,1013,3],[1013,5,1013,7],[1013,8,1013,9],[1014,2,1014,3],[1014,5,1014,7],[1014,8,1014,9],[1015,2,1015,3],[1015,5,1015,7],[1015,8,1015,9],[1008,2,1008,3],[1008,5,1008,7],[1008,8,1008,9],[1009,2,1009,3],[1009,5,1009,7],[1009,8,1009,9],[1010,2,1010,3],[1010,5,1010,7],[1010,8,1010,9],[1005,2,1005,3],[1005,5,1005,7],[1005,8,1005,9],[1006,2,1006,3],[1006,5,1006,7],[1006,8,1006,9],[1007,2,1007,3],[1007,5,1007,7],[1007,8,1007,9],[1000,2,1000,3],[1000,5,1000,7],[1000,8,1000,9],[1003,2,1003,3],[1003,5,1003,7],[1003,8,1003,9],[1004,2,1004,3],[1004,5,1004,7],[1004,8,1004,9],[997,2,997,3],[997,5,997,7],[997,8,997,9],[998,2,998,3],[998,5,998,7],[998,8,998,9],[999,2,999,3],[999,5,999,7],[999,8,999,9],[994,2,994,3],[994,5,994,7],[994,8,994,9],[995,2,995,3],[995,5,995,7],[995,8,995,9],[996,2,996,3],[996,5,996,7],[996,8,996,9],[989,2,989,3],[989,5,989,7],[989,8,989,9],[990,2,990,3],[990,5,990,7],[990,8,990,9],[993,2,993,3],[993,5,993,7],[993,8,993,9],[986,2,986,3],[986,5,986,7],[986,8,986,9],[987,2,987,3],[987,5,987,7],[987,8,987,9],[988,2,988,3],[988,5,988,7],[988,8,988,9],[983,2,983,3],[983,5,983,7],[983,8,983,9],[984,2,984,3],[984,5,984,7],[984,8,984,9],[985,2,985,3],[985,5,985,7],[985,8,985,9],[978,2,978,3],[978,5,978,7],[978,8,978,9],[979,2,979,3],[979,5,979,7],[979,8,979,9],[980,2,980,3],[980,5,980,7],[980,8,980,9]],"merged_total":5615,"flags":["merged_cut"]}
[null,null,"Governo do Estado do Paraná\nSecretaria das Cidades\nRua Jacy Loureiro de Campos, nº 180| 2º andar | Centro Cívico  CEP 80530-140 | Caixa Postal 15079\nCuritiba | Paraná | Fone (41) 3350 – 3300  http://www.paranacidade.org.br/"]
[]
[]
["PARECER URBANÍSTICO"]
[]
["Município:",{"$f":"'FICHA DE PROJETO'!B6","v":"CAFEARA"},null,null,null,null,"CNPJ:",{"$f":"'FICHA DE PROJETO'!H6","v":75845545000106},null,null,null,null,null,"Formatação do CNPJ:      00\".\"000\".\"000\"/\"0000-00"]
[]
[{"$f":"'FICHA DE PROJETO'!A8","v":"Projeto:"},{"$f":"'FICHA DE PROJETO'!B8","v":"Pavimentação Asfáltica em CBUQ"},null,null,null,null,"Componente: ",{"$f":"'FICHA DE PROJETO'!H8","v":"Sistema Viário"}]
[]
[{"$f":"'FICHA DE PROJETO'!A10","v":"Prioridade:"},{"$f":"'FICHA DE PROJETO'!B10","v":49},{"$f":"'FICHA DE PROJETO'!C10","v":"Programa"},null,{"$f":"'FICHA DE PROJETO'!E10","v":"PAM"},null,"Convênio:",{"$f":"'FICHA DE PROJETO'!H10","v":0}]
[]
[]
["Contato:",{"$f":"'FICHA DE PROJETO'!B15","v":"Luiz Eduardo Candido"},null,null,null,null,"CPF:",{"$f":"'FICHA DE PROJETO'!H15","v":"063.225.***"}]
[]
["CAU/CREA:",{"$f":"'FICHA DE PROJETO'!B17","v":"CREA PR - 145.164/D"},null,null,null,null,"Cargo:",{"$f":"'FICHA DE PROJETO'!H17","v":"Engenheiro Civil"}]
[]
["e-mail:",{"$f":"'FICHA DE PROJETO'!B19","v":"lecandido.candido@gmail.com"},null,null,null,null,"Telefone:",{"$f":"'FICHA DE PROJETO'!H19","v":"(44) 98409-2602"}]
[]
[]
["01. DESCRIÇÃO DO OBJETO"]
[]
[{"$f":"'FICHA DE PROJETO'!A24","v":"Pavimentação de vias urbanas em CBUQ,  10.892,70 m2, incluindo serviços preliminares, terraplenagem, base e sub-base, revestimento, meio-fio e sarjeta, urbanização, sinalização de trânsito, drenagem e ensaios tecnológicos."}]
[]
["02. LOCALIZAÇÃO"]
[]
[{"$f":"'FICHA DE PROJETO'!A28","v":"Vias urbanas na Sede do Município"}]
[]
["03. OBJETO (VIAS A SEREM PAVIMENTADAS)",null,null,null,null,null,null,null,null,null,null,"ocultar vazias\nselecionar \" X \""]
[{"$f":"IF(('FICHA DE PROJETO'!K32=\"X\"),\"Lote 01\",\"---\")","v":"Lote 01"},null,null,null,null,null,null,null,null,null,null,{"$f":"IF(('FICHA DE PROJETO'!K32=\"X\"),\"X\",\"---\")","v":"X"}]
[null,"R01",{"$f":"IF(ISTEXT(VLOOKUP(B30,'FICHA DE PROJETO'!$A$33:$I$213,2,FALSE)),VLOOKUP(B30,'FICHA DE PROJETO'!$A$33:$I$213,2,FALSE),\"\")","v":"RUA VITAL PIRES DE LIMA entre a Avenida Paraná e Rua Silvio Picinini;"},null,null,null,null,null,null,null,null,{"$f":"IF(C30=\"\",\"--\",\"X\")","v":"X"}]
[null,"R02",{"$f":"IF(ISTEXT(VLOOKUP(B31,'FICHA DE PROJETO'!$A$33:$I$213,2,FALSE)),VLOOKUP(B31,'FICHA DE PROJETO'!$A$33:$I$213,2,FALSE),\"\")","v":"RUA MATIAS APARECIDO FOGAÇA entre as Ruas Vital Pires de Lima e Ângelo Bianco;"},null,null,null,null,null,null,null,null,{"$f":"IF(C31=\"\",\"--\",\"X\")","v":"X"}]
[null,"R03",{"$f":"IF(ISTEXT(VLOOKUP(B32,'FICHA DE PROJETO'!$A$33:$I$213,2,FALSE)),VLOOKUP(B32,'FICHA DE PROJETO'!$A$33:$I$213,2,FALSE),\"\")","v":"RUA SÍLVIO PICININI entre as Ruas Vital Pires de Lima e Virgínio Turozi;"},null,null,null,null,null,null,null,null,"X"]
[null,"R04",{"$f":"IF(ISTEXT(VLOOKUP(B33,'FICHA DE PROJETO'!$A$33:$I$213,2,FALSE)),VLOOKUP(B33,'FICHA DE PROJETO'!$A$33:$I$213,2,FALSE),\"\")","v":"RUA HÉLIO BARCO entre as Ruas Angelo Bianco e Virgínio Turozi;"},null,null,null,null,null,null,null,null,"X"]
[null,"R05",{"$f":"IF(ISTEXT(VLOOKUP(B34,'FICHA DE PROJETO'!$A$33:$I$213,2,FALSE)),VLOOKUP(B34,'FICHA DE PROJETO'!$A$33:$I$213,2,FALSE),\"\")","v":"RUA ÂNGELO BIANCO entre as Ruas Sílvio Picinini e Hélio Barco."},null,null,null,null,null,null,null,null,"X"]
[null,"R06",{"$f":"IF(ISTEXT(VLOOKUP(B35,'FICHA DE PROJETO'!$A$33:$I$213,2,FALSE)),VLOOKUP(B35,'FICHA DE PROJETO'!$A$33:$I$213,2,FALSE),\"\")","v":"RUA PROJETADA \"A\" entre as Ruaas Sílvio Picinini e Hélio Barco;"},null,null,null,null,null,null,null,null,"X"]
[null,"R07",{"$f":"IF(ISTEXT(VLOOKUP(B36,'FICHA DE PROJETO'!$A$33:$I$213,2,FALSE)),VLOOKUP(B36,'FICHA DE PROJETO'!$A$33:$I$213,2,FALSE),\"\")","v":"RUA HELENA DEOTTI COSTA com início na Rua João Sperandio até o final a 100,00m;"},null,null,null,null,null,null,null,null,"X"]
[null,"R08",{"$f":"IF(ISTEXT(VLOOKUP(B37,'FICHA DE PROJETO'!$A$33:$I$213,2,FALSE)),VLOOKUP(B37,'FICHA DE PROJETO'!$A$33:$I$213,2,FALSE),\"\")","v":"RUA BOIADEIRO entre a Rua Dionísio Ternulina da Silva e Travessa \"C\"."},null,null,null,null,null,null,null,null,"X"]
[null,"R09",{"$f":"IF(ISTEXT(VLOOKUP(B38,'FICHA DE PROJETO'!$A$33:$I$213,2,FALSE)),VLOOKUP(B38,'FICHA DE PROJETO'!$A$33:$I$213,2,FALSE),\"\")","v":""},null,null,null,null,null,null,null,null,"--"]
[null,"R10",{"$f":"IF(ISTEXT(VLOOKUP(B39,'FICHA DE PROJETO'!$A$33:$I$213,2,FALSE)),VLOOKUP(B39,'FICHA DE PROJETO'!$A$33:$I$213,2,FALSE),\"\")","v":""},null,null,null,null,null,null,null,null,"--"]
[null,"R11",{"$f":"IF(ISTEXT(VLOOKUP(B40,'FICHA DE PROJETO'!$A$33:$I$213,2,FALSE)),VLOOKUP(B40,'FICHA DE PROJETO'!$A$33:$I$213,2,FALSE),\"\")","v":""},null,null,null,null,null,null,null,null,"--"]
[null,"R12",{"$f":"IF(ISTEXT(VLOOKUP(B41,'FICHA DE PROJETO'!$A$33:$I$213,2,FALSE)),VLOOKUP(B41,'FICHA DE PROJETO'!$A$33:$I$213,2,FALSE),\"\")","v":""},null,null,null,null,null,null,null,null,"--"]
[null,"R13",{"$f":"IF(ISTEXT(VLOOKUP(B42,'FICHA DE PROJETO'!$A$33:$I$213,2,FALSE)),VLOOKUP(B42,'FICHA DE PROJETO'!$A$33:$I$213,2,FALSE),\"\")","v":""},null,null,null,null,null,null,null,null,"--"]
[null,"R14",{"$f":"IF(ISTEXT(VLOOKUP(B43,'FICHA DE PROJETO'!$A$33:$I$213,2,FALSE)),VLOOKUP(B43,'FICHA DE PROJETO'!$A$33:$I$213,2,FALSE),\"\")","v":""},null,null,null,null,null,null,null,null,"--"]
[null,"R15",{"$f":"IF(ISTEXT(VLOOKUP(B44,'FICHA DE PROJETO'!$A$33:$I$213,2,FALSE)),VLOOKUP(B44,'FICHA DE PROJETO'!$A$33:$I$213,2,FALSE),\"\")","v":""},null,null,null,null,null,null,null,null,"--"]
[null,"R16",{"$f":"IF(ISTEXT(VLOOKUP(B45,'FICHA DE PROJETO'!$A$33:$I$213,2,FALSE)),VLOOKUP(B45,'FICHA DE PROJETO'!$A$33:$I$213,2,FALSE),\"\")","v":""},null,null,null,null,null,null,null,null,"--"]
[null,"R17",{"$f":"IF(ISTEXT(VLOOKUP(B46,'FICHA DE PROJETO'!$A$33:$I$213,2,FALSE)),VLOOKUP(B46,'FICHA DE PROJETO'!$A$33:$I$213,2,FALSE),\"\")","v":""},null,null,null,null,null,null,null,null,"--"]
[null,"R18",{"$f":"IF(ISTEXT(VLOOKUP(B47,'FICHA DE PROJETO'!$A$33:$I$213,2,FALSE)),VLOOKUP(B47,'FICHA DE PROJETO'!$A$33:$I$213,2,FALSE),\"\")","v":""},null,null,null,null,null,null,null,null,"--"]
[null,"R19",{"$f":"IF(ISTEXT(VLOOKUP(B48,'FICHA DE PROJETO'!$A$33:$I$213,2,FALSE)),VLOOKUP(B48,'FICHA DE PROJETO'!$A$33:$I$213,2,FALSE),\"\")","v":""},null,null,null,null,null,null,null,null,"--"]
[null,"R20",{"$f":"IF(ISTEXT(VLOOKUP(B49,'FICHA DE PROJETO'!$A$33:$I$213,2,FALSE)),VLOOKUP(B49,'FICHA DE PROJETO'!$A$33:$I$213,2,FALSE),\"\")","v":""},null,null,null,null,null,null,null,null,"--"]
[null,"R21",{"$f":"IF(ISTEXT(VLOOKUP(B50,'FICHA DE PROJETO'!$A$33:$I$213,2,FALSE)),VLOOKUP(B50,'FICHA DE PROJETO'!$A$33:$I$213,2,FALSE),\"\")","v":""},null,null,null,null,null,null,null,null,"--"]
[null,"R22",{"$f":"IF(ISTEXT(VLOOKUP(B51,'FICHA DE PROJETO'!$A$33:$I$213,2,FALSE)),VLOOKUP(B51,'FICHA DE PROJETO'!$A$33:$I$213,2,FALSE),\"\")","v":""},null,null,null,null,null,null,null,null,"--"]
[null,"R23",{"$f":"IF(ISTEXT(VLOOKUP(B52,'FICHA DE PROJETO'!$A$33:$I$213,2,FALSE)),VLOOKUP(B52,'FICHA DE PROJETO'!$A$33:$I$213,2,FALSE),\"\")","v":""},null,null,null,null,null,null,null,null,"--"]
[null,"R24",{"$f":"IF(ISTEXT(VLOOKUP(B53,'FICHA DE PROJETO'!$A$33:$I$213,2,FALSE)),VLOOKUP(B53,'FICHA DE PROJETO'!$A$33:$I$213,2,FALSE),\"\")","v":""},null,null,null,null,null,null,null,null,"--"]
[null,"R25",{"$f":"IF(ISTEXT(VLOOKUP(B54,'FICHA DE PROJETO'!$A$33:$I$213,2,FALSE)),VLOOKUP(B54,'FICHA DE PROJETO'!$A$33:$I$213,2,FALSE),\"\")","v":""},null,null,null,null,null,null,null,null,"--"]
[null,"R26",{"$f":"IF(ISTEXT(VLOOKUP(B55,'FICHA DE PROJETO'!$A$33:$I$213,2,FALSE)),VLOOKUP(B55,'FICHA DE PROJETO'!$A$33:$I$213,2,FALSE),\"\")","v":""},null,null,null,null,null,null,null,null,"--"]
[null,"R27",{"$f":"IF(ISTEXT(VLOOKUP(B56,'FICHA DE PROJETO'!$A$33:$I$213,2,FALSE)),VLOOKUP(B56,'FICHA DE PROJETO'!$A$33:$I$213,2,FALSE),\"\")","v":""},null,null,null,null,null,null,null,null,"--"]
[null,"R28",{"$f":"IF(ISTEXT(VLOOKUP(B57,'FICHA DE PROJETO'!$A$33:$I$213,2,FALSE)),VLOOKUP(B57,'FICHA DE PROJETO'!$A$33:$I$213,2,FALSE),\"\")","v":""},null,null,null,null,null,null,null,null,"--"]
[null,"R29",{"$f":"IF(ISTEXT(VLOOKUP(B58,'FICHA DE PROJETO'!$A$33:$I$213,2,FALSE)),VLOOKUP(B58,'FICHA DE PROJETO'!$A$33:$I$213,2,FALSE),\"\")","v":""},null,null,null,null,null,null,null,null,"--"]
[null,"R30",{"$f":"IF(ISTEXT(VLOOKUP(B59,'FICHA DE PROJETO'!$A$33:$I$213,2,FALSE)),VLOOKUP(B59,'FICHA DE PROJETO'!$A$33:$I$213,2,FALSE),\"\")","v":""},null,null,null,null,null,null,null,null,"--"]
[null,"R31",{"$f":"IF(ISTEXT(VLOOKUP(B60,'FICHA DE PROJETO'!$A$33:$I$213,2,FALSE)),VLOOKUP(B60,'FICHA DE PROJETO'!$A$33:$I$213,2,FALSE),\"\")","v":""},null,null,null,null,null,null,null,null,"--"]
[null,"R32",{"$f":"IF(ISTEXT(VLOOKUP(B61,'FICHA DE PROJETO'!$A$33:$I$213,2,FALSE)),VLOOKUP(B61,'FICHA DE PROJETO'!$A$33:$I$213,2,FALSE),\"\")","v":""},null,null,null,null,null,null,null,null,"--"]
[null,"R33",{"$f":"IF(ISTEXT(VLOOKUP(B62,'FICHA DE PROJETO'!$A$33:$I$213,2,FALSE)),VLOOKUP(B62,'FICHA DE PROJETO'!$A$33:$I$213,2,FALSE),\"\")","v":""},null,null,null,null,null,null,null,null,"--"]
[null,"R34",{"$f":"IF(ISTEXT(VLOOKUP(B63,'FICHA DE PROJETO'!$A$33:$I$213,2,FALSE)),VLOOKUP(B63,'FICHA DE PROJETO'!$A$33:$I$213,2,FALSE),\"\")","v":""},null,null,null,null,null,null,null,null,"--"]
[null,"R35",{"$f":"IF(ISTEXT(VLOOKUP(B64,'FICHA DE PROJETO'!$A$33:$I$213,2,FALSE)),VLOOKUP(B64,'FICHA DE PROJETO'!$A$33:$I$213,2,FALSE),\"\")","v":""},null,null,null,null,null,null,null,null,"--"]
[null,"R36",{"$f":"IF(ISTEXT(VLOOKUP(B65,'FICHA DE PROJETO'!$A$33:$I$213,2,FALSE)),VLOOKUP(B65,'FICHA DE PROJETO'!$A$33:$I$213,2,FALSE),\"\")","v":""},null,null,null,null,null,null,null,null,"--"]
[null,"R37",{"$f":"IF(ISTEXT(VLOOKUP(B66,'FICHA DE PROJETO'!$A$33:$I$213,2,FALSE)),VLOOKUP(B66,'FICHA DE PROJETO'!$A$33:$I$213,2,FALSE),\"\")","v":""},null,null,null,null,null,null,null,null,"--"]
[null,"R38",{"$f":"IF(ISTEXT(VLOOKUP(B67,'FICHA DE PROJETO'!$A$33:$I$213,2,FALSE)),VLOOKUP(B67,'FICHA DE PROJETO'!$A$33:$I$213,2,FALSE),\"\")","v":""},null,null,null,null,null,null,null,null,"--"]
[null,"R39",{"$f":"IF(ISTEXT(VLOOKUP(B68,'FICHA DE PROJETO'!$A$33:$I$213,2,FALSE)),VLOOKUP(B68,'FICHA DE PROJETO'!$A$33:$I$213,2,FALSE),\"\")","v":""},null,null,null,null,null,null,null,null,"--"]
[null,"R40",{"$f":"IF(ISTEXT(VLOOKUP(B69,'FICHA DE PROJETO'!$A$33:$I$213,2,FALSE)),VLOOKUP(B69,'FICHA DE PROJETO'!$A$33:$I$213,2,FALSE),\"\")","v":""},null,null,null,null,null,null,null,null,"--"]
[null,"R41",{"$f":"IF(ISTEXT(VLOOKUP(B70,'FICHA DE PROJETO'!$A$33:$I$213,2,FALSE)),VLOOKUP(B70,'FICHA DE PROJETO'!$A$33:$I$213,2,FALSE),\"\")","v":""},null,null,null,null,null,null,null,null,"--"]
[null,"R42",{"$f":"IF(ISTEXT(VLOOKUP(B71,'FICHA DE PROJETO'!$A$33:$I$213,2,FALSE)),VLOOKUP(B71,'FICHA DE PROJETO'!$A$33:$I$213,2,FALSE),\"\")","v":""},null,null,null,null,null,null,null,null,"--"]
[null,"R43",{"$f":"IF(ISTEXT(VLOOKUP(B72,'FICHA DE PROJETO'!$A$33:$I$213,2,FALSE)),VLOOKUP(B72,'FICHA DE PROJETO'!$A$33:$I$213,2,FALSE),\"\")","v":""},null,null,null,null,null,null,null,null,"--"]
[null,"R44",{"$f":"IF(ISTEXT(VLOOKUP(B73,'FICHA DE PROJETO'!$A$33:$I$213,2,FALSE)),VLOOKUP(B73,'FICHA DE PROJETO'!$A$33:$I$213,2,FALSE),\"\")","v":""},null,null,null,null,null,null,null,null,"--"]
[null,"R45",{"$f":"IF(ISTEXT(VLOOKUP(B74,'FICHA DE PROJETO'!$A$33:$I$213,2,FALSE)),VLOOKUP(B74,'FICHA DE PROJETO'!$A$33:$I$213,2,FALSE),\"\")","v":""},null,null,null,null,null,null,null,null,"--"]
[null,"R46",{"$f":"IF(ISTEXT(VLOOKUP(B75,'FICHA DE PROJETO'!$A$33:$I$213,2,FALSE)),VLOOKUP(B75,'FICHA DE PROJETO'!$A$33:$I$213,2,FALSE),\"\")","v":""},null,null,null,null,null,null,null,null,"--"]
[null,"R47",{"$f":"IF(ISTEXT(VLOOKUP(B76,'FICHA DE PROJETO'!$A$33:$I$213,2,FALSE)),VLOOKUP(B76,'FICHA DE PROJETO'!$A$33:$I$213,2,FALSE),\"\")","v":""},null,null,null,null,null,null,null,null,"--"]
[null,"R48",{"$f":"IF(ISTEXT(VLOOKUP(B77,'FICHA DE PROJETO'!$A$33:$I$213,2,FALSE)),VLOOKUP(B77,'FICHA DE PROJETO'!$A$33:$I$213,2,FALSE),\"\")","v":""},null,null,null,null,null,null,null,null,"--"]
[null,"R49",{"$f":"IF(ISTEXT(VLOOKUP(B78,'FICHA DE PROJETO'!$A$33:$I$213,2,FALSE)),VLOOKUP(B78,'FICHA DE PROJETO'!$A$33:$I$213,2,FALSE),\"\")","v":""},null,null,null,null,null,null,null,null,"--"]
[null,"R50",{"$f":"IF(ISTEXT(VLOOKUP(B79,'FICHA DE PROJETO'!$A$33:$I$213,2,FALSE)),VLOOKUP(B79,'FICHA DE PROJETO'!$A$33:$I$213,2,FALSE),\"\")","v":""},null,null,null,null,null,null,null,null,"--"]
[null,"R51",{"$f":"IF(ISTEXT(VLOOKUP(B80,'FICHA DE PROJETO'!$A$33:$I$213,2,FALSE)),VLOOKUP(B80,'FICHA DE PROJETO'!$A$33:$I$213,2,FALSE),\"\")","v":""},null,null,null,null,null,null,null,null,"--"]
[null,"R52",{"$f":"IF(ISTEXT(VLOOKUP(B81,'FICHA DE PROJETO'!$A$33:$I$213,2,FALSE)),VLOOKUP(B81,'FICHA DE PROJETO'!$A$33:$I$213,2,FALSE),\"\")","v":""},null,null,null,null,null,null,null,null,"--"]
[null,"R53",{"$f":"IF(ISTEXT(VLOOKUP(B82,'FICHA DE PROJETO'!$A$33:$I$213,2,FALSE)),VLOOKUP(B82,'FICHA DE PROJETO'!$A$33:$I$213,2,FALSE),\"\")","v":""},null,null,null,null,null,null,null,null,"--"]
[null,"R54",{"$f":"IF(ISTEXT(VLOOKUP(B83,'FICHA DE PROJETO'!$A$33:$I$213,2,FALSE)),VLOOKUP(B83,'FICHA DE PROJETO'!$A$33:$I$213,2,FALSE),\"\")","v":""},null,null,null,null,null,null,null,null,"--"]
[null,"R55",{"$f":"IF(ISTEXT(VLOOKUP(B84,'FICHA DE PROJETO'!$A$33:$I$213,2,FALSE)),VLOOKUP(B84,'FICHA DE PROJETO'!$A$33:$I$213,2,FALSE),\"\")","v":""},null,null,null,null,null,null,null,null,"--"]
[null,"R56",{"$f":"IF(ISTEXT(VLOOKUP(B85,'FICHA DE PROJETO'!$A$33:$I$213,2,FALSE)),VLOOKUP(B85,'FICHA DE PROJETO'!$A$33:$I$213,2,FALSE),\"\")","v":""},null,null,null,null,null,null,null,null,"--"]
[null,"R57",{"$f":"IF(ISTEXT(VLOOKUP(B86,'FICHA DE PROJETO'!$A$33:$I$213,2,FALSE)),VLOOKUP(B86,'FICHA DE PROJETO'!$A$33:$I$213,2,FALSE),\"\")","v":""},null,null,null,null,null,null,null,null,"--"]
[null,"R58",{"$f":"IF(ISTEXT(VLOOKUP(B87,'FICHA DE PROJETO'!$A$33:$I$213,2,FALSE)),VLOOKUP(B87,'FICHA DE PROJETO'!$A$33:$I$213,2,FALSE),\"\")","v":""},null,null,null,null,null,null,null,null,"--"]
[null,"R59",{"$f":"IF(ISTEXT(VLOOKUP(B88,'FICHA DE PROJETO'!$A$33:$I$213,2,FALSE)),VLOOKUP(B88,'FICHA DE PROJETO'!$A$33:$I$213,2,FALSE),\"\")","v":""},null,null,null,null,null,null,null,null,"--"]
[null,"R60",{"$f":"IF(ISTEXT(VLOOKUP(B89,'FICHA DE PROJETO'!$A$33:$I$213,2,FALSE)),VLOOKUP(B89,'FICHA DE PROJETO'!$A$33:$I$213,2,FALSE),\"\")","v":""},null,null,null,null,null,null,null,null,"--"]
[null,"R61",{"$f":"IF(ISTEXT(VLOOKUP(B90,'FICHA DE PROJETO'!$A$33:$I$213,2,FALSE)),VLOOKUP(B90,'FICHA DE PROJETO'!$A$33:$I$213,2,FALSE),\"\")","v":""},null,null,null,null,null,null,null,null,"--"]
[null,"R62",{"$f":"IF(ISTEXT(VLOOKUP(B91,'FICHA DE PROJETO'!$A$33:$I$213,2,FALSE)),VLOOKUP(B91,'FICHA DE PROJETO'!$A$33:$I$213,2,FALSE),\"\")","v":""},null,null,null,null,null,null,null,null,"--"]
[null,"R63",{"$f":"IF(ISTEXT(VLOOKUP(B92,'FICHA DE PROJETO'!$A$33:$I$213,2,FALSE)),VLOOKUP(B92,'FICHA DE PROJETO'!$A$33:$I$213,2,FALSE),\"\")","v":""},null,null,null,null,null,null,null,null,"--"]
[null,"R64",{"$f":"IF(ISTEXT(VLOOKUP(B93,'FICHA DE PROJETO'!$A$33:$I$213,2,FALSE)),VLOOKUP(B93,'FICHA DE PROJETO'!$A$33:$I$213,2,FALSE),\"\")","v":""},null,null,null,null,null,null,null,null,"--"]
[null,"R65",{"$f":"IF(ISTEXT(VLOOKUP(B94,'FICHA DE PROJETO'!$A$33:$I$213,2,FALSE)),VLOOKUP(B94,'FICHA DE PROJETO'!$A$33:$I$213,2,FALSE),\"\")","v":""},null,null,null,null,null,null,null,null,"--"]
[null,"R66",{"$f":"IF(ISTEXT(VLOOKUP(B95,'FICHA DE PROJETO'!$A$33:$I$213,2,FALSE)),VLOOKUP(B95,'FICHA DE PROJETO'!$A$33:$I$213,2,FALSE),\"\")","v":""},null,null,null,null,null,null,null,null,{"$f":"IF(C95=\"\",\"--\",\"X\")","v":"--"}]
[null,"R67",{"$f":"IF(ISTEXT(VLOOKUP(B96,'FICHA DE PROJETO'!$A$33:$I$213,2,FALSE)),VLOOKUP(B96,'FICHA DE PROJETO'!$A$33:$I$213,2,FALSE),\"\")","v":""},null,null,null,null,null,null,null,null,"--"]
[null,"R68",{"$f":"IF(ISTEXT(VLOOKUP(B97,'FICHA DE PROJETO'!$A$33:$I$213,2,FALSE)),VLOOKUP(B97,'FICHA DE PROJETO'!$A$33:$I$213,2,FALSE),\"\")","v":""},null,null,null,null,null,null,null,null,"--"]
[null,"R69",{"$f":"IF(ISTEXT(VLOOKUP(B98,'FICHA DE PROJETO'!$A$33:$I$213,2,FALSE)),VLOOKUP(B98,'FICHA DE PROJETO'!$A$33:$I$213,2,FALSE),\"\")","v":""},null,null,null,null,null,null,null,null,"--"]
[null,"R70",{"$f":"IF(ISTEXT(VLOOKUP(B99,'FICHA DE PROJETO'!$A$33:$I$213,2,FALSE)),VLOOKUP(B99,'FICHA DE PROJETO'!$A$33:$I$213,2,FALSE),\"\")","v":""},null,null,null,null,null,null,null,null,"--"]
[null,"R71",{"$f":"IF(ISTEXT(VLOOKUP(B100,'FICHA DE PROJETO'!$A$33:$I$213,2,FALSE)),VLOOKUP(B100,'FICHA DE PROJETO'!$A$33:$I$213,2,FALSE),\"\")","v":""},null,null,null,null,null,null,null,null,"--"]
[null,"R72",{"$f":"IF(ISTEXT(VLOOKUP(B101,'FICHA DE PROJETO'!$A$33:$I$213,2,FALSE)),VLOOKUP(B101,'FICHA DE PROJETO'!$A$33:$I$213,2,FALSE),\"\")","v":""},null,null,null,null,null,null,null,null,"--"]
[null,"R73",{"$f":"IF(ISTEXT(VLOOKUP(B102,'FICHA DE PROJETO'!$A$33:$I$213,2,FALSE)),VLOOKUP(B102,'FICHA DE PROJETO'!$A$33:$I$213,2,FALSE),\"\")","v":""},null,null,null,null,null,null,null,null,"--"]
[null,"R74",{"$f":"IF(ISTEXT(VLOOKUP(B103,'FICHA DE PROJETO'!$A$33:$I$213,2,FALSE)),VLOOKUP(B103,'FICHA DE PROJETO'!$A$33:$I$213,2,FALSE),\"\")","v":""},null,null,null,null,null,null,null,null,"--"]
[null,"R75",{"$f":"IF(ISTEXT(VLOOKUP(B104,'FICHA DE PROJETO'!$A$33:$I$213,2,FALSE)),VLOOKUP(B104,'FICHA DE PROJETO'!$A$33:$I$213,2,FALSE),\"\")","v":""},null,null,null,null,null,null,null,null,"--"]
[null,"R76",{"$f":"IF(ISTEXT(VLOOKUP(B105,'FICHA DE PROJETO'!$A$33:$I$213,2,FALSE)),VLOOKUP(B105,'FICHA DE PROJETO'!$A$33:$I$213,2,FALSE),\"\")","v":""},null,null,null,null,null,null,null,null,"--"]
[null,"R77",{"$f":"IF(ISTEXT(VLOOKUP(B106,'FICHA DE PROJETO'!$A$33:$I$213,2,FALSE)),VLOOKUP(B106,'FICHA DE PROJETO'!$A$33:$I$213,2,FALSE),\"\")","v":""},null,null,null,null,null,null,null,null,"--"]
[null,"R78",{"$f":"IF(ISTEXT(VLOOKUP(B107,'FICHA DE PROJETO'!$A$33:$I$213,2,FALSE)),VLOOKUP(B107,'FICHA DE PROJETO'!$A$33:$I$213,2,FALSE),\"\")","v":""},null,null,null,null,null,null,null,null,"--"]
[null,"R79",{"$f":"IF(ISTEXT(VLOOKUP(B108,'FICHA DE PROJETO'!$A$33:$I$213,2,FALSE)),VLOOKUP(B108,'FICHA DE PROJETO'!$A$33:$I$213,2,FALSE),\"\")","v":""},null,null,null,null,null,null,null,null,"--"]
[null,"R80",{"$f":"IF(ISTEXT(VLOOKUP(B109,'FICHA DE PROJETO'!$A$33:$I$213,2,FALSE)),VLOOKUP(B109,'FICHA DE PROJETO'!$A$33:$I$213,2,FALSE),\"\")","v":""},null,null,null,null,null,null,null,null,"--"]
[null,"R81",{"$f":"IF(ISTEXT(VLOOKUP(B110,'FICHA DE PROJETO'!$A$33:$I$213,2,FALSE)),VLOOKUP(B110,'FICHA DE PROJETO'!$A$33:$I$213,2,FALSE),\"\")","v":""},null,null,null,null,null,null,null,null,"--"]
[null,"R82",{"$f":"IF(ISTEXT(VLOOKUP(B111,'FICHA DE PROJETO'!$A$33:$I$213,2,FALSE)),VLOOKUP(B111,'FICHA DE PROJETO'!$A$33:$I$213,2,FALSE),\"\")","v":""},null,null,null,null,null,null,null,null,"--"]
[null,"R83",{"$f":"IF(ISTEXT(VLOOKUP(B112,'FICHA DE PROJETO'!$A$33:$I$213,2,FALSE)),VLOOKUP(B112,'FICHA DE PROJETO'!$A$33:$I$213,2,FALSE),\"\")","v":""},null,null,null,null,null,null,null,null,"--"]
[null,"R84",{"$f":"IF(ISTEXT(VLOOKUP(B113,'FICHA DE PROJETO'!$A$33:$I$213,2,FALSE)),VLOOKUP(B113,'FICHA DE PROJETO'!$A$33:$I$213,2,FALSE),\"\")","v":""},null,null,null,null,null,null,null,null,"--"]
[null,"R85",{"$f":"IF(ISTEXT(VLOOKUP(B114,'FICHA DE PROJETO'!$A$33:$I$213,2,FALSE)),VLOOKUP(B114,'FICHA DE PROJETO'!$A$33:$I$213,2,FALSE),\"\")","v":""},null,null,null,null,null,null,null,null,"--"]
[null,"R86",{"$f":"IF(ISTEXT(VLOOKUP(B115,'FICHA DE PROJETO'!$A$33:$I$213,2,FALSE)),VLOOKUP(B115,'FICHA DE PROJETO'!$A$33:$I$213,2,FALSE),\"\")","v":""},null,null,null,null,null,null,null,null,"--"]
[null,"R87",{"$f":"IF(ISTEXT(VLOOKUP(B116,'FICHA DE PROJETO'!$A$33:$I$213,2,FALSE)),VLOOKUP(B116,'FICHA DE PROJETO'!$A$33:$I$213,2,FALSE),\"\")","v":""},null,null,null,null,null,null,null,null,"--"]
[null,"R88",{"$f":"IF(ISTEXT(VLOOKUP(B117,'FICHA DE PROJETO'!$A$33:$I$213,2,FALSE)),VLOOKUP(B117,'FICHA DE PROJETO'!$A$33:$I$213,2,FALSE),\"\")","v":""},null,null,null,null,null,null,null,null,"--"]
[null,"R89",{"$f":"IF(ISTEXT(VLOOKUP(B118,'FICHA DE PROJETO'!$A$33:$I$213,2,FALSE)),VLOOKUP(B118,'FICHA DE PROJETO'!$A$33:$I$213,2,FALSE),\"\")","v":""},null,null,null,null,null,null,null,null,"--"]
[null,"R90",{"$f":"IF(ISTEXT(VLOOKUP(B119,'FICHA DE PROJETO'!$A$33:$I$213,2,FALSE)),VLOOKUP(B119,'FICHA DE PROJETO'!$A$33:$I$213,2,FALSE),\"\")","v":""},null,null,null,null,null,null,null,null,"--"]
[null,"R91",{"$f":"IF(ISTEXT(VLOOKUP(B120,'FICHA DE PROJETO'!$A$33:$I$213,2,FALSE)),VLOOKUP(B120,'FICHA DE PROJETO'!$A$33:$I$213,2,FALSE),\"\")","v":""},null,null,null,null,null,null,null,null,"--"]
[null,"R92",{"$f":"IF(ISTEXT(VLOOKUP(B121,'FICHA DE PROJETO'!$A$33:$I$213,2,FALSE)),VLOOKUP(B121,'FICHA DE PROJETO'!$A$33:$I$213,2,FALSE),\"\")","v":""},null,null,null,null,null,null,null,null,"--"]
[null,"R93",{"$f":"IF(ISTEXT(VLOOKUP(B122,'FICHA DE PROJETO'!$A$33:$I$213,2,FALSE)),VLOOKUP(B122,'FICHA DE PROJETO'!$A$33:$I$213,2,FALSE),\"\")","v":""},null,null,null,null,null,null,null,null,"--"]
[null,"R94",{"$f":"IF(ISTEXT(VLOOKUP(B123,'FICHA DE PROJETO'!$A$33:$I$213,2,FALSE)),VLOOKUP(B123,'FICHA DE PROJETO'!$A$33:$I$213,2,FALSE),\"\")","v":""},null,null,null,null,null,null,null,null,"--"]
[null,"R95",{"$f":"IF(ISTEXT(VLOOKUP(B124,'FICHA DE PROJETO'!$A$33:$I$213,2,FALSE)),VLOOKUP(B124,'FICHA DE PROJETO'!$A$33:$I$213,2,FALSE),\"\")","v":""},null,null,null,null,null,null,null,null,"--"]
[null,"R96",{"$f":"IF(ISTEXT(VLOOKUP(B125,'FICHA DE PROJETO'!$A$33:$I$213,2,FALSE)),VLOOKUP(B125,'FICHA DE PROJETO'!$A$33:$I$213,2,FALSE),\"\")","v":""},null,null,null,null,null,null,null,null,"--"]
[null,"R97",{"$f":"IF(ISTEXT(VLOOKUP(B126,'FICHA DE PROJETO'!$A$33:$I$213,2,FALSE)),VLOOKUP(B126,'FICHA DE PROJETO'!$A$33:$I$213,2,FALSE),\"\")","v":""},null,null,null,null,null,null,null,null,"--"]
[null,"R98",{"$f":"IF(ISTEXT(VLOOKUP(B127,'FICHA DE PROJETO'!$A$33:$I$213,2,FALSE)),VLOOKUP(B127,'FICHA DE PROJETO'!$A$33:$I$213,2,FALSE),\"\")","v":""},null,null,null,null,null,null,null,null,"--"]
[null,"R99",{"$f":"IF(ISTEXT(VLOOKUP(B128,'FICHA DE PROJETO'!$A$33:$I$213,2,FALSE)),VLOOKUP(B128,'FICHA DE PROJETO'!$A$33:$I$213,2,FALSE),\"\")","v":""},null,null,null,null,null,null,null,null,"--"]
[null,"R100",{"$f":"IF(ISTEXT(VLOOKUP(B129,'FICHA DE PROJETO'!$A$33:$I$213,2,FALSE)),VLOOKUP(B129,'FICHA DE PROJETO'!$A$33:$I$213,2,FALSE),\"\")","v":""},null,null,null,null,null,null,null,null,"--"]
[null,"R101",{"$f":"IF(ISTEXT(VLOOKUP(B130,'FICHA DE PROJETO'!$A$33:$I$213,2,FALSE)),VLOOKUP(B130,'FICHA DE PROJETO'!$A$33:$I$213,2,FALSE),\"\")","v":""},null,null,null,null,null,null,null,null,"--"]
[null,"R102",{"$f":"IF(ISTEXT(VLOOKUP(B131,'FICHA DE PROJETO'!$A$33:$I$213,2,FALSE)),VLOOKUP(B131,'FICHA DE PROJETO'!$A$33:$I$213,2,FALSE),\"\")","v":""},null,null,null,null,null,null,null,null,"--"]
[null,"R103",{"$f":"IF(ISTEXT(VLOOKUP(B132,'FICHA DE PROJETO'!$A$33:$I$213,2,FALSE)),VLOOKUP(B132,'FICHA DE PROJETO'!$A$33:$I$213,2,FALSE),\"\")","v":""},null,null,null,null,null,null,null,null,"--"]
[null,"R104",{"$f":"IF(ISTEXT(VLOOKUP(B133,'FICHA DE PROJETO'!$A$33:$I$213,2,FALSE)),VLOOKUP(B133,'FICHA DE PROJETO'!$A$33:$I$213,2,FALSE),\"\")","v":""},null,null,null,null,null,null,null,null,"--"]
[null,"R105",{"$f":"IF(ISTEXT(VLOOKUP(B134,'FICHA DE PROJETO'!$A$33:$I$213,2,FALSE)),VLOOKUP(B134,'FICHA DE PROJETO'!$A$33:$I$213,2,FALSE),\"\")","v":""},null,null,null,null,null,null,null,null,"--"]
[null,"R106",{"$f":"IF(ISTEXT(VLOOKUP(B135,'FICHA DE PROJETO'!$A$33:$I$213,2,FALSE)),VLOOKUP(B135,'FICHA DE PROJETO'!$A$33:$I$213,2,FALSE),\"\")","v":""},null,null,null,null,null,null,null,null,"--"]
[null,"R107",{"$f":"IF(ISTEXT(VLOOKUP(B136,'FICHA DE PROJETO'!$A$33:$I$213,2,FALSE)),VLOOKUP(B136,'FICHA DE PROJETO'!$A$33:$I$213,2,FALSE),\"\")","v":""},null,null,null,null,null,null,null,null,"--"]
[null,"R108",{"$f":"IF(ISTEXT(VLOOKUP(B137,'FICHA DE PROJETO'!$A$33:$I$213,2,FALSE)),VLOOKUP(B137,'FICHA DE PROJETO'!$A$33:$I$213,2,FALSE),\"\")","v":""},null,null,null,null,null,null,null,null,"--"]
[null,"R109",{"$f":"IF(ISTEXT(VLOOKUP(B138,'FICHA DE PROJETO'!$A$33:$I$213,2,FALSE)),VLOOKUP(B138,'FICHA DE PROJETO'!$A$33:$I$213,2,FALSE),\"\")","v":""},null,null,null,null,null,null,null,null,"--"]
[null,"R110",{"$f":"IF(ISTEXT(VLOOKUP(B139,'FICHA DE PROJETO'!$A$33:$I$213,2,FALSE)),VLOOKUP(B139,'FICHA DE PROJETO'!$A$33:$I$213,2,FALSE),\"\")","v":""},null,null,null,null,null,null,null,null,"--"]
[null,"R111",{"$f":"IF(ISTEXT(VLOOKUP(B140,'FICHA DE PROJETO'!$A$33:$I$213,2,FALSE)),VLOOKUP(B140,'FICHA DE PROJETO'!$A$33:$I$213,2,FALSE),\"\")","v":""},null,null,null,null,null,null,null,null,"--"]
[null,"R112",{"$f":"IF(ISTEXT(VLOOKUP(B141,'FICHA DE PROJETO'!$A$33:$I$213,2,FALSE)),VLOOKUP(B141,'FICHA DE PROJETO'!$A$33:$I$213,2,FALSE),\"\")","v":""},null,null,null,null,null,null,null,null,"--"]
[null,"R113",{"$f":"IF(ISTEXT(VLOOKUP(B142,'FICHA DE PROJETO'!$A$33:$I$213,2,FALSE)),VLOOKUP(B142,'FICHA DE PROJETO'!$A$33:$I$213,2,FALSE),\"\")","v":""},null,null,null,null,null,null,null,null,"--"]
[null,"R114",{"$f":"IF(ISTEXT(VLOOKUP(B143,'FICHA DE PROJETO'!$A$33:$I$213,2,FALSE)),VLOOKUP(B143,'FICHA DE PROJETO'!$A$33:$I$213,2,FALSE),\"\")","v":""},null,null,null,null,null,null,null,null,"--"]
[null,"R115",{"$f":"IF(ISTEXT(VLOOKUP(B144,'FICHA DE PROJETO'!$A$33:$I$213,2,FALSE)),VLOOKUP(B144,'FICHA DE PROJETO'!$A$33:$I$213,2,FALSE),\"\")","v":""},null,null,null,null,null,null,null,null,"--"]
[null,"R116",{"$f":"IF(ISTEXT(VLOOKUP(B145,'FICHA DE PROJETO'!$A$33:$I$213,2,FALSE)),VLOOKUP(B145,'FICHA DE PROJETO'!$A$33:$I$213,2,FALSE),\"\")","v":""},null,null,null,null,null,null,null,null,"--"]
[null,"R117",{"$f":"IF(ISTEXT(VLOOKUP(B146,'FICHA DE PROJETO'!$A$33:$I$213,2,FALSE)),VLOOKUP(B146,'FICHA DE PROJETO'!$A$33:$I$213,2,FALSE),\"\")","v":""},null,null,null,null,null,null,null,null,"--"]
[null,"R118",{"$f":"IF(ISTEXT(VLOOKUP(B147,'FICHA DE PROJETO'!$A$33:$I$213,2,FALSE)),VLOOKUP(B147,'FICHA DE PROJETO'!$A$33:$I$213,2,FALSE),\"\")","v":""},null,null,null,null,null,null,null,null,"--"]
[null,"R119",{"$f":"IF(ISTEXT(VLOOKUP(B148,'FICHA DE PROJETO'!$A$33:$I$213,2,FALSE)),VLOOKUP(B148,'FICHA DE PROJETO'!$A$33:$I$213,2,FALSE),\"\")","v":""},null,null,null,null,null,null,null,null,"--"]
[null,"R120",{"$f":"IF(ISTEXT(VLOOKUP(B149,'FICHA DE PROJETO'!$A$33:$I$213,2,FALSE)),VLOOKUP(B149,'FICHA DE PROJETO'!$A$33:$I$213,2,FALSE),\"\")","v":""},null,null,null,null,null,null,null,null,"--"]
[null,"R121",{"$f":"IF(ISTEXT(VLOOKUP(B150,'FICHA DE PROJETO'!$A$33:$I$213,2,FALSE)),VLOOKUP(B150,'FICHA DE PROJETO'!$A$33:$I$213,2,FALSE),\"\")","v":""},null,null,null,null,null,null,null,null,"--"]
[null,"R122",{"$f":"IF(ISTEXT(VLOOKUP(B151,'FICHA DE PROJETO'!$A$33:$I$213,2,FALSE)),VLOOKUP(B151,'FICHA DE PROJETO'!$A$33:$I$213,2,FALSE),\"\")","v":""},null,null,null,null,null,null,null,null,"--"]
[null,"R123",{"$f":"IF(ISTEXT(VLOOKUP(B152,'FICHA DE PROJETO'!$A$33:$I$213,2,FALSE)),VLOOKUP(B152,'FICHA DE PROJETO'!$A$33:$I$213,2,FALSE),\"\")","v":""},null,null,null,null,null,null,null,null,"--"]
[null,"R124",{"$f":"IF(ISTEXT(VLOOKUP(B153,'FICHA DE PROJETO'!$A$33:$I$213,2,FALSE)),VLOOKUP(B153,'FICHA DE PROJETO'!$A$33:$I$213,2,FALSE),\"\")","v":""},null,null,null,null,null,null,null,null,"--"]
[null,"R125",{"$f":"IF(ISTEXT(VLOOKUP(B154,'FICHA DE PROJETO'!$A$33:$I$213,2,FALSE)),VLOOKUP(B154,'FICHA DE PROJETO'!$A$33:$I$213,2,FALSE),\"\")","v":""},null,null,null,null,null,null,null,null,"--"]
[null,"R126",{"$f":"IF(ISTEXT(VLOOKUP(B155,'FICHA DE PROJETO'!$A$33:$I$213,2,FALSE)),VLOOKUP(B155,'FICHA DE PROJETO'!$A$33:$I$213,2,FALSE),\"\")","v":""},null,null,null,null,null,null,null,null,"--"]
[null,"R127",{"$f":"IF(ISTEXT(VLOOKUP(B156,'FICHA DE PROJETO'!$A$33:$I$213,2,FALSE)),VLOOKUP(B156,'FICHA DE PROJETO'!$A$33:$I$213,2,FALSE),\"\")","v":""},null,null,null,null,null,null,null,null,"--"]
[null,"R128",{"$f":"IF(ISTEXT(VLOOKUP(B157,'FICHA DE PROJETO'!$A$33:$I$213,2,FALSE)),VLOOKUP(B157,'FICHA DE PROJETO'!$A$33:$I$213,2,FALSE),\"\")","v":""},null,null,null,null,null,null,null,null,"--"]
[null,"R129",{"$f":"IF(ISTEXT(VLOOKUP(B158,'FICHA DE PROJETO'!$A$33:$I$213,2,FALSE)),VLOOKUP(B158,'FICHA DE PROJETO'!$A$33:$I$213,2,FALSE),\"\")","v":""},null,null,null,null,null,null,null,null,"--"]
[null,"R130",{"$f":"IF(ISTEXT(VLOOKUP(B159,'FICHA DE PROJETO'!$A$33:$I$213,2,FALSE)),VLOOKUP(B159,'FICHA DE PROJETO'!$A$33:$I$213,2,FALSE),\"\")","v":""},null,null,null,null,null,null,null,null,{"$f":"IF(C159=\"\",\"--\",\"X\")","v":"--"}]
[null,"R131",{"$f":"IF(ISTEXT(VLOOKUP(B160,'FICHA DE PROJETO'!$A$33:$I$213,2,FALSE)),VLOOKUP(B160,'FICHA DE PROJETO'!$A$33:$I$213,2,FALSE),\"\")","v":""},null,null,null,null,null,null,null,null,"--"]
[null,"R132",{"$f":"IF(ISTEXT(VLOOKUP(B161,'FICHA DE PROJETO'!$A$33:$I$213,2,FALSE)),VLOOKUP(B161,'FICHA DE PROJETO'!$A$33:$I$213,2,FALSE),\"\")","v":""},null,null,null,null,null,null,null,null,"--"]
[null,"R133",{"$f":"IF(ISTEXT(VLOOKUP(B162,'FICHA DE PROJETO'!$A$33:$I$213,2,FALSE)),VLOOKUP(B162,'FICHA DE PROJETO'!$A$33:$I$213,2,FALSE),\"\")","v":""},null,null,null,null,null,null,null,null,"--"]
[null,"R134",{"$f":"IF(ISTEXT(VLOOKUP(B163,'FICHA DE PROJETO'!$A$33:$I$213,2,FALSE)),VLOOKUP(B163,'FICHA DE PROJETO'!$A$33:$I$213,2,FALSE),\"\")","v":""},null,null,null,null,null,null,null,null,"--"]
[null,"R135",{"$f":"IF(ISTEXT(VLOOKUP(B164,'FICHA DE PROJETO'!$A$33:$I$213,2,FALSE)),VLOOKUP(B164,'FICHA DE PROJETO'!$A$33:$I$213,2,FALSE),\"\")","v":""},null,null,null,null,null,null,null,null,"--"]
[null,"R136",{"$f":"IF(ISTEXT(VLOOKUP(B165,'FICHA DE PROJETO'!$A$33:$I$213,2,FALSE)),VLOOKUP(B165,'FICHA DE PROJETO'!$A$33:$I$213,2,FALSE),\"\")","v":""},null,null,null,null,null,null,null,null,"--"]
[null,"R137",{"$f":"IF(ISTEXT(VLOOKUP(B166,'FICHA DE PROJETO'!$A$33:$I$213,2,FALSE)),VLOOKUP(B166,'FICHA DE PROJETO'!$A$33:$I$213,2,FALSE),\"\")","v":""},null,null,null,null,null,null,null,null,"--"]
[null,"R138",{"$f":"IF(ISTEXT(VLOOKUP(B167,'FICHA DE PROJETO'!$A$33:$I$213,2,FALSE)),VLOOKUP(B167,'FICHA DE PROJETO'!$A$33:$I$213,2,FALSE),\"\")","v":""},null,null,null,null,null,null,null,null,"--"]
[null,"R139",{"$f":"IF(ISTEXT(VLOOKUP(B168,'FICHA DE PROJETO'!$A$33:$I$213,2,FALSE)),VLOOKUP(B168,'FICHA DE PROJETO'!$A$33:$I$213,2,FALSE),\"\")","v":""},null,null,null,null,null,null,null,null,"--"]
[null,"R140",{"$f":"IF(ISTEXT(VLOOKUP(B169,'FICHA DE PROJETO'!$A$33:$I$213,2,FALSE)),VLOOKUP(B169,'FICHA DE PROJETO'!$A$33:$I$213,2,FALSE),\"\")","v":""},null,null,null,null,null,null,null,null,"--"]
[null,"R141",{"$f":"IF(ISTEXT(VLOOKUP(B170,'FICHA DE PROJETO'!$A$33:$I$213,2,FALSE)),VLOOKUP(B170,'FICHA DE PROJETO'!$A$33:$I$213,2,FALSE),\"\")","v":""},null,null,null,null,null,null,null,null,"--"]
[null,"R142",{"$f":"IF(ISTEXT(VLOOKUP(B171,'FICHA DE PROJETO'!$A$33:$I$213,2,FALSE)),VLOOKUP(B171,'FICHA DE PROJETO'!$A$33:$I$213,2,FALSE),\"\")","v":""},null,null,null,null,null,null,null,null,"--"]
[null,"R143",{"$f":"IF(ISTEXT(VLOOKUP(B172,'FICHA DE PROJETO'!$A$33:$I$213,2,FALSE)),VLOOKUP(B172,'FICHA DE PROJETO'!$A$33:$I$213,2,FALSE),\"\")","v":""},null,null,null,null,null,null,null,null,"--"]
[null,"R144",{"$f":"IF(ISTEXT(VLOOKUP(B173,'FICHA DE PROJETO'!$A$33:$I$213,2,FALSE)),VLOOKUP(B173,'FICHA DE PROJETO'!$A$33:$I$213,2,FALSE),\"\")","v":""},null,null,null,null,null,null,null,null,"--"]
[null,"R145",{"$f":"IF(ISTEXT(VLOOKUP(B174,'FICHA DE PROJETO'!$A$33:$I$213,2,FALSE)),VLOOKUP(B174,'FICHA DE PROJETO'!$A$33:$I$213,2,FALSE),\"\")","v":""},null,null,null,null,null,null,null,null,"--"]
[null,"R146",{"$f":"IF(ISTEXT(VLOOKUP(B175,'FICHA DE PROJETO'!$A$33:$I$213,2,FALSE)),VLOOKUP(B175,'FICHA DE PROJETO'!$A$33:$I$213,2,FALSE),\"\")","v":""},null,null,null,null,null,null,null,null,"--"]
[null,"R147",{"$f":"IF(ISTEXT(VLOOKUP(B176,'FICHA DE PROJETO'!$A$33:$I$213,2,FALSE)),VLOOKUP(B176,'FICHA DE PROJETO'!$A$33:$I$213,2,FALSE),\"\")","v":""},null,null,null,null,null,null,null,null,"--"]
[null,"R148",{"$f":"IF(ISTEXT(VLOOKUP(B177,'FICHA DE PROJETO'!$A$33:$I$213,2,FALSE)),VLOOKUP(B177,'FICHA DE PROJETO'!$A$33:$I$213,2,FALSE),\"\")","v":""},null,null,null,null,null,null,null,null,"--"]
[null,"R149",{"$f":"IF(ISTEXT(VLOOKUP(B178,'FICHA DE PROJETO'!$A$33:$I$213,2,FALSE)),VLOOKUP(B178,'FICHA DE PROJETO'!$A$33:$I$213,2,FALSE),\"\")","v":""},null,null,null,null,null,null,null,null,"--"]
[null,"R150",{"$f":"IF(ISTEXT(VLOOKUP(B179,'FICHA DE PROJETO'!$A$33:$I$213,2,FALSE)),VLOOKUP(B179,'FICHA DE PROJETO'!$A$33:$I$213,2,FALSE),\"\")","v":""},null,null,null,null,null,null,null,null,"--"]
[null,"R151",{"$f":"IF(ISTEXT(VLOOKUP(B180,'FICHA DE PROJETO'!$A$33:$I$213,2,FALSE)),VLOOKUP(B180,'FICHA DE PROJETO'!$A$33:$I$213,2,FALSE),\"\")","v":""},null,null,null,null,null,null,null,null,"--"]
[null,"R152",{"$f":"IF(ISTEXT(VLOOKUP(B181,'FICHA DE PROJETO'!$A$33:$I$213,2,FALSE)),VLOOKUP(B181,'FICHA DE PROJETO'!$A$33:$I$213,2,FALSE),\"\")","v":""},null,null,null,null,null,null,null,null,"--"]
[null,"R153",{"$f":"IF(ISTEXT(VLOOKUP(B182,'FICHA DE PROJETO'!$A$33:$I$213,2,FALSE)),VLOOKUP(B182,'FICHA DE PROJETO'!$A$33:$I$213,2,FALSE),\"\")","v":""},null,null,null,null,null,null,null,null,"--"]
[null,"R154",{"$f":"IF(ISTEXT(VLOOKUP(B183,'FICHA DE PROJETO'!$A$33:$I$213,2,FALSE)),VLOOKUP(B183,'FICHA DE PROJETO'!$A$33:$I$213,2,FALSE),\"\")","v":""},null,null,null,null,null,null,null,null,"--"]
[null,"R155",{"$f":"IF(ISTEXT(VLOOKUP(B184,'FICHA DE PROJETO'!$A$33:$I$213,2,FALSE)),VLOOKUP(B184,'FICHA DE PROJETO'!$A$33:$I$213,2,FALSE),\"\")","v":""},null,null,null,null,null,null,null,null,"--"]
[null,"R156",{"$f":"IF(ISTEXT(VLOOKUP(B185,'FICHA DE PROJETO'!$A$33:$I$213,2,FALSE)),VLOOKUP(B185,'FICHA DE PROJETO'!$A$33:$I$213,2,FALSE),\"\")","v":""},null,null,null,null,null,null,null,null,"--"]
[null,"R157",{"$f":"IF(ISTEXT(VLOOKUP(B186,'FICHA DE PROJETO'!$A$33:$I$213,2,FALSE)),VLOOKUP(B186,'FICHA DE PROJETO'!$A$33:$I$213,2,FALSE),\"\")","v":""},null,null,null,null,null,null,null,null,"--"]
[null,"R158",{"$f":"IF(ISTEXT(VLOOKUP(B187,'FICHA DE PROJETO'!$A$33:$I$213,2,FALSE)),VLOOKUP(B187,'FICHA DE PROJETO'!$A$33:$I$213,2,FALSE),\"\")","v":""},null,null,null,null,null,null,null,null,"--"]
[null,"R159",{"$f":"IF(ISTEXT(VLOOKUP(B188,'FICHA DE PROJETO'!$A$33:$I$213,2,FALSE)),VLOOKUP(B188,'FICHA DE PROJETO'!$A$33:$I$213,2,FALSE),\"\")","v":""},null,null,null,null,null,null,null,null,"--"]
[null,"R160",{"$f":"IF(ISTEXT(VLOOKUP(B189,'FICHA DE PROJETO'!$A$33:$I$213,2,FALSE)),VLOOKUP(B189,'FICHA DE PROJETO'!$A$33:$I$213,2,FALSE),\"\")","v":""},null,null,null,null,null,null,null,null,"--"]
[null,"R161",{"$f":"IF(ISTEXT(VLOOKUP(B190,'FICHA DE PROJETO'!$A$33:$I$213,2,FALSE)),VLOOKUP(B190,'FICHA DE PROJETO'!$A$33:$I$213,2,FALSE),\"\")","v":""},null,null,null,null,null,null,null,null,"--"]
[null,"R162",{"$f":"IF(ISTEXT(VLOOKUP(B191,'FICHA DE PROJETO'!$A$33:$I$213,2,FALSE)),VLOOKUP(B191,'FICHA DE PROJETO'!$A$33:$I$213,2,FALSE),\"\")","v":""},null,null,null,null,null,null,null,null,"--"]
[null,"R163",{"$f":"IF(ISTEXT(VLOOKUP(B192,'FICHA DE PROJETO'!$A$33:$I$213,2,FALSE)),VLOOKUP(B192,'FICHA DE PROJETO'!$A$33:$I$213,2,FALSE),\"\")","v":""},null,null,null,null,null,null,null,null,"--"]
[null,"R164",{"$f":"IF(ISTEXT(VLOOKUP(B193,'FICHA DE PROJETO'!$A$33:$I$213,2,FALSE)),VLOOKUP(B193,'FICHA DE PROJETO'!$A$33:$I$213,2,FALSE),\"\")","v":""},null,null,null,null,null,null,null,null,"--"]
[null,"R165",{"$f":"IF(ISTEXT(VLOOKUP(B194,'FICHA DE PROJETO'!$A$33:$I$213,2,FALSE)),VLOOKUP(B194,'FICHA DE PROJETO'!$A$33:$I$213,2,FALSE),\"\")","v":""},null,null,null,null,null,null,null,null,"--"]
[null,"R166",{"$f":"IF(ISTEXT(VLOOKUP(B195,'FICHA DE PROJETO'!$A$33:$I$213,2,FALSE)),VLOOKUP(B195,'FICHA DE PROJETO'!$A$33:$I$213,2,FALSE),\"\")","v":""},null,null,null,null,null,null,null,null,"--"]
[null,"R167",{"$f":"IF(ISTEXT(VLOOKUP(B196,'FICHA DE PROJETO'!$A$33:$I$213,2,FALSE)),VLOOKUP(B196,'FICHA DE PROJETO'!$A$33:$I$213,2,FALSE),\"\")","v":""},null,null,null,null,null,null,null,null,"--"]
[null,"R168",{"$f":"IF(ISTEXT(VLOOKUP(B197,'FICHA DE PROJETO'!$A$33:$I$213,2,FALSE)),VLOOKUP(B197,'FICHA DE PROJETO'!$A$33:$I$213,2,FALSE),\"\")","v":""},null,null,null,null,null,null,null,null,"--"]
[null,"R169",{"$f":"IF(ISTEXT(VLOOKUP(B198,'FICHA DE PROJETO'!$A$33:$I$213,2,FALSE)),VLOOKUP(B198,'FICHA DE PROJETO'!$A$33:$I$213,2,FALSE),\"\")","v":""},null,null,null,null,null,null,null,null,"--"]
[null,"R170",{"$f":"IF(ISTEXT(VLOOKUP(B199,'FICHA DE PROJETO'!$A$33:$I$213,2,FALSE)),VLOOKUP(B199,'FICHA DE PROJETO'!$A$33:$I$213,2,FALSE),\"\")","v":""},null,null,null,null,null,null,null,null,"--"]
[null,"R171",{"$f":"IF(ISTEXT(VLOOKUP(B200,'FICHA DE PROJETO'!$A$33:$I$213,2,FALSE)),VLOOKUP(B200,'FICHA DE PROJETO'!$A$33:$I$213,2,FALSE),\"\")","v":""},null,null,null,null,null,null,null,null,"--"]
[null,"R172",{"$f":"IF(ISTEXT(VLOOKUP(B201,'FICHA DE PROJETO'!$A$33:$I$213,2,FALSE)),VLOOKUP(B201,'FICHA DE PROJETO'!$A$33:$I$213,2,FALSE),\"\")","v":""},null,null,null,null,null,null,null,null,"--"]
[null,"R173",{"$f":"IF(ISTEXT(VLOOKUP(B202,'FICHA DE PROJETO'!$A$33:$I$213,2,FALSE)),VLOOKUP(B202,'FICHA DE PROJETO'!$A$33:$I$213,2,FALSE),\"\")","v":""},null,null,null,null,null,null,null,null,"--"]
[null,"R174",{"$f":"IF(ISTEXT(VLOOKUP(B203,'FICHA DE PROJETO'!$A$33:$I$213,2,FALSE)),VLOOKUP(B203,'FICHA DE PROJETO'!$A$33:$I$213,2,FALSE),\"\")","v":""},null,null,null,null,null,null,null,null,"--"]
[null,"R175",{"$f":"IF(ISTEXT(VLOOKUP(B204,'FICHA DE PROJETO'!$A$33:$I$213,2,FALSE)),VLOOKUP(B204,'FICHA DE PROJETO'!$A$33:$I$213,2,FALSE),\"\")","v":""},null,null,null,null,null,null,null,null,"--"]
[null,"R176",{"$f":"IF(ISTEXT(VLOOKUP(B205,'FICHA DE PROJETO'!$A$33:$I$213,2,FALSE)),VLOOKUP(B205,'FICHA DE PROJETO'!$A$33:$I$213,2,FALSE),\"\")","v":""},null,null,null,null,null,null,null,null,"--"]
[null,"R177",{"$f":"IF(ISTEXT(VLOOKUP(B206,'FICHA DE PROJETO'!$A$33:$I$213,2,FALSE)),VLOOKUP(B206,'FICHA DE PROJETO'!$A$33:$I$213,2,FALSE),\"\")","v":""},null,null,null,null,null,null,null,null,"--"]
[null,"R178",{"$f":"IF(ISTEXT(VLOOKUP(B207,'FICHA DE PROJETO'!$A$33:$I$213,2,FALSE)),VLOOKUP(B207,'FICHA DE PROJETO'!$A$33:$I$213,2,FALSE),\"\")","v":""},null,null,null,null,null,null,null,null,"--"]
[null,"R179",{"$f":"IF(ISTEXT(VLOOKUP(B208,'FICHA DE PROJETO'!$A$33:$I$213,2,FALSE)),VLOOKUP(B208,'FICHA DE PROJETO'!$A$33:$I$213,2,FALSE),\"\")","v":""},null,null,null,null,null,null,null,null,"--"]
[null,"R180",{"$f":"IF(ISTEXT(VLOOKUP(B209,'FICHA DE PROJETO'!$A$33:$I$213,2,FALSE)),VLOOKUP(B209,'FICHA DE PROJETO'!$A$33:$I$213,2,FALSE),\"\")","v":""},null,null,null,null,null,null,null,null,"--"]
[null,null,null,null,null,null,null,null,null,null,null,{"$f":"IF(('FICHA DE PROJETO'!$K$215=\"X\"),\"X\",\"---\")","v":"---"}]
[{"$f":"IF(('FICHA DE PROJETO'!K215=\"X\"),\"Lote 02\",\"---\")","v":"---"},null,null,null,null,null,null,null,null,null,null,{"$f":"IF(('FICHA DE PROJETO'!$K$215=\"X\"),\"X\",\"---\")","v":"---"}]
[null,"R01",{"$f":"IF(ISTEXT(VLOOKUP(B212,'FICHA DE PROJETO'!$A$216:$I$398,2,FALSE)),VLOOKUP(B212,'FICHA DE PROJETO'!$A$216:$I$398,2,FALSE),\"\")","v":""},null,null,null,null,null,null,null,null,"--"]
[null,"R02",{"$f":"IF(ISTEXT(VLOOKUP(B213,'FICHA DE PROJETO'!$A$216:$I$398,2,FALSE)),VLOOKUP(B213,'FICHA DE PROJETO'!$A$216:$I$398,2,FALSE),\"\")","v":""},null,null,null,null,null,null,null,null,"--"]
[null,"R03",{"$f":"IF(ISTEXT(VLOOKUP(B214,'FICHA DE PROJETO'!$A$216:$I$398,2,FALSE)),VLOOKUP(B214,'FICHA DE PROJETO'!$A$216:$I$398,2,FALSE),\"\")","v":""},null,null,null,null,null,null,null,null,"--"]
[null,"R04",{"$f":"IF(ISTEXT(VLOOKUP(B215,'FICHA DE PROJETO'!$A$216:$I$398,2,FALSE)),VLOOKUP(B215,'FICHA DE PROJETO'!$A$216:$I$398,2,FALSE),\"\")","v":""},null,null,null,null,null,null,null,null,"--"]
[null,"R05",{"$f":"IF(ISTEXT(VLOOKUP(B216,'FICHA DE PROJETO'!$A$216:$I$398,2,FALSE)),VLOOKUP(B216,'FICHA DE PROJETO'!$A$216:$I$398,2,FALSE),\"\")","v":""},null,null,null,null,null,null,null,null,"--"]
[null,"R06",{"$f":"IF(ISTEXT(VLOOKUP(B217,'FICHA DE PROJETO'!$A$216:$I$398,2,FALSE)),VLOOKUP(B217,'FICHA DE PROJETO'!$A$216:$I$398,2,FALSE),\"\")","v":""},null,null,null,null,null,null,null,null,"--"]
[null,"R07",{"$f":"IF(ISTEXT(VLOOKUP(B218,'FICHA DE PROJETO'!$A$216:$I$398,2,FALSE)),VLOOKUP(B218,'FICHA DE PROJETO'!$A$216:$I$398,2,FALSE),\"\")","v":""},null,null,null,null,null,null,null,null,"--"]
[null,"R08",{"$f":"IF(ISTEXT(VLOOKUP(B219,'FICHA DE PROJETO'!$A$216:$I$398,2,FALSE)),VLOOKUP(B219,'FICHA DE PROJETO'!$A$216:$I$398,2,FALSE),\"\")","v":""},null,null,null,null,null,null,null,null,"--"]
[null,"R09",{"$f":"IF(ISTEXT(VLOOKUP(B220,'FICHA DE PROJETO'!$A$216:$I$398,2,FALSE)),VLOOKUP(B220,'FICHA DE PROJETO'!$A$216:$I$398,2,FALSE),\"\")","v":""},null,null,null,null,null,null,null,null,"--"]
[null,"R10",{"$f":"IF(ISTEXT(VLOOKUP(B221,'FICHA DE PROJETO'!$A$216:$I$398,2,FALSE)),VLOOKUP(B221,'FICHA DE PROJETO'!$A$216:$I$398,2,FALSE),\"\")","v":""},null,null,null,null,null,null,null,null,"--"]
[null,"R11",{"$f":"IF(ISTEXT(VLOOKUP(B222,'FICHA DE PROJETO'!$A$216:$I$398,2,FALSE)),VLOOKUP(B222,'FICHA DE PROJETO'!$A$216:$I$398,2,FALSE),\"\")","v":""},null,null,null,null,null,null,null,null,"--"]
[null,"R12",{"$f":"IF(ISTEXT(VLOOKUP(B223,'FICHA DE PROJETO'!$A$216:$I$398,2,FALSE)),VLOOKUP(B223,'FICHA DE PROJETO'!$A$216:$I$398,2,FALSE),\"\")","v":""},null,null,null,null,null,null,null,null,"--"]
[null,"R13",{"$f":"IF(ISTEXT(VLOOKUP(B224,'FICHA DE PROJETO'!$A$216:$I$398,2,FALSE)),VLOOKUP(B224,'FICHA DE PROJETO'!$A$216:$I$398,2,FALSE),\"\")","v":""},null,null,null,null,null,null,null,null,{"$f":"IF(C224=\"\",\"--\",\"X\")","v":"--"}]
[null,"R14",{"$f":"IF(ISTEXT(VLOOKUP(B225,'FICHA DE PROJETO'!$A$216:$I$398,2,FALSE)),VLOOKUP(B225,'FICHA DE PROJETO'!$A$216:$I$398,2,FALSE),\"\")","v":""},null,null,null,null,null,null,null,null,"--"]
[null,"R15",{"$f":"IF(ISTEXT(VLOOKUP(B226,'FICHA DE PROJETO'!$A$216:$I$398,2,FALSE)),VLOOKUP(B226,'FICHA DE PROJETO'!$A$216:$I$398,2,FALSE),\"\")","v":""},null,null,null,null,null,null,null,null,"--"]
[null,"R16",{"$f":"IF(ISTEXT(VLOOKUP(B227,'FICHA DE PROJETO'!$A$216:$I$398,2,FALSE)),VLOOKUP(B227,'FICHA DE PROJETO'!$A$216:$I$398,2,FALSE),\"\")","v":""},null,null,null,null,null,null,null,null,"--"]
[null,"R17",{"$f":"IF(ISTEXT(VLOOKUP(B228,'FICHA DE PROJETO'!$A$216:$I$398,2,FALSE)),VLOOKUP(B228,'FICHA DE PROJETO'!$A$216:$I$398,2,FALSE),\"\")","v":""},null,null,null,null,null,null,null,null,"--"]
[null,"R18",{"$f":"IF(ISTEXT(VLOOKUP(B229,'FICHA DE PROJETO'!$A$216:$I$398,2,FALSE)),VLOOKUP(B229,'FICHA DE PROJETO'!$A$216:$I$398,2,FALSE),\"\")","v":""},null,null,null,null,null,null,null,null,"--"]
[null,"R19",{"$f":"IF(ISTEXT(VLOOKUP(B230,'FICHA DE PROJETO'!$A$216:$I$398,2,FALSE)),VLOOKUP(B230,'FICHA DE PROJETO'!$A$216:$I$398,2,FALSE),\"\")","v":""},null,null,null,null,null,null,null,null,"--"]
[null,"R20",{"$f":"IF(ISTEXT(VLOOKUP(B231,'FICHA DE PROJETO'!$A$216:$I$398,2,FALSE)),VLOOKUP(B231,'FICHA DE PROJETO'!$A$216:$I$398,2,FALSE),\"\")","v":""},null,null,null,null,null,null,null,null,"--"]
[null,"R21",{"$f":"IF(ISTEXT(VLOOKUP(B232,'FICHA DE PROJETO'!$A$216:$I$398,2,FALSE)),VLOOKUP(B232,'FICHA DE PROJETO'!$A$216:$I$398,2,FALSE),\"\")","v":""},null,null,null,null,null,null,null,null,"--"]
[null,"R22",{"$f":"IF(ISTEXT(VLOOKUP(B233,'FICHA DE PROJETO'!$A$216:$I$398,2,FALSE)),VLOOKUP(B233,'FICHA DE PROJETO'!$A$216:$I$398,2,FALSE),\"\")","v":""},null,null,null,null,null,null,null,null,"--"]
[null,"R23",{"$f":"IF(ISTEXT(VLOOKUP(B234,'FICHA DE PROJETO'!$A$216:$I$398,2,FALSE)),VLOOKUP(B234,'FICHA DE PROJETO'!$A$216:$I$398,2,FALSE),\"\")","v":""},null,null,null,null,null,null,null,null,"--"]
[null,"R24",{"$f":"IF(ISTEXT(VLOOKUP(B235,'FICHA DE PROJETO'!$A$216:$I$398,2,FALSE)),VLOOKUP(B235,'FICHA DE PROJETO'!$A$216:$I$398,2,FALSE),\"\")","v":""},null,null,null,null,null,null,null,null,"--"]
[null,"R25",{"$f":"IF(ISTEXT(VLOOKUP(B236,'FICHA DE PROJETO'!$A$216:$I$398,2,FALSE)),VLOOKUP(B236,'FICHA DE PROJETO'!$A$216:$I$398,2,FALSE),\"\")","v":""},null,null,null,null,null,null,null,null,"--"]
[null,"R26",{"$f":"IF(ISTEXT(VLOOKUP(B237,'FICHA DE PROJETO'!$A$216:$I$398,2,FALSE)),VLOOKUP(B237,'FICHA DE PROJETO'!$A$216:$I$398,2,FALSE),\"\")","v":""},null,null,null,null,null,null,null,null,"--"]
[null,"R27",{"$f":"IF(ISTEXT(VLOOKUP(B238,'FICHA DE PROJETO'!$A$216:$I$398,2,FALSE)),VLOOKUP(B238,'FICHA DE PROJETO'!$A$216:$I$398,2,FALSE),\"\")","v":""},null,null,null,null,null,null,null,null,"--"]
[null,"R28",{"$f":"IF(ISTEXT(VLOOKUP(B239,'FICHA DE PROJETO'!$A$216:$I$398,2,FALSE)),VLOOKUP(B239,'FICHA DE PROJETO'!$A$216:$I$398,2,FALSE),\"\")","v":""},null,null,null,null,null,null,null,null,"--"]
[null,"R29",{"$f":"IF(ISTEXT(VLOOKUP(B240,'FICHA DE PROJETO'!$A$216:$I$398,2,FALSE)),VLOOKUP(B240,'FICHA DE PROJETO'!$A$216:$I$398,2,FALSE),\"\")","v":""},null,null,null,null,null,null,null,null,"--"]
[null,"R30",{"$f":"IF(ISTEXT(VLOOKUP(B241,'FICHA DE PROJETO'!$A$216:$I$398,2,FALSE)),VLOOKUP(B241,'FICHA DE PROJETO'!$A$216:$I$398,2,FALSE),\"\")","v":""},null,null,null,null,null,null,null,null,"--"]
[null,"R31",{"$f":"IF(ISTEXT(VLOOKUP(B242,'FICHA DE PROJETO'!$A$216:$I$398,2,FALSE)),VLOOKUP(B242,'FICHA DE PROJETO'!$A$216:$I$398,2,FALSE),\"\")","v":""},null,null,null,null,null,null,null,null,"--"]
[null,"R32",{"$f":"IF(ISTEXT(VLOOKUP(B243,'FICHA DE PROJETO'!$A$216:$I$398,2,FALSE)),VLOOKUP(B243,'FICHA DE PROJETO'!$A$216:$I$398,2,FALSE),\"\")","v":""},null,null,null,null,null,null,null,null,"--"]
[null,"R33",{"$f":"IF(ISTEXT(VLOOKUP(B244,'FICHA DE PROJETO'!$A$216:$I$398,2,FALSE)),VLOOKUP(B244,'FICHA DE PROJETO'!$A$216:$I$398,2,FALSE),\"\")","v":""},null,null,null,null,null,null,null,null,"--"]
[null,"R34",{"$f":"IF(ISTEXT(VLOOKUP(B245,'FICHA DE PROJETO'!$A$216:$I$398,2,FALSE)),VLOOKUP(B245,'FICHA DE PROJETO'!$A$216:$I$398,2,FALSE),\"\")","v":""},null,null,null,null,null,null,null,null,"--"]
[null,"R35",{"$f":"IF(ISTEXT(VLOOKUP(B246,'FICHA DE PROJETO'!$A$216:$I$398,2,FALSE)),VLOOKUP(B246,'FICHA DE PROJETO'!$A$216:$I$398,2,FALSE),\"\")","v":""},null,null,null,null,null,null,null,null,"--"]
[null,"R36",{"$f":"IF(ISTEXT(VLOOKUP(B247,'FICHA DE PROJETO'!$A$216:$I$398,2,FALSE)),VLOOKUP(B247,'FICHA DE PROJETO'!$A$216:$I$398,2,FALSE),\"\")","v":""},null,null,null,null,null,null,null,null,"--"]
[null,"R37",{"$f":"IF(ISTEXT(VLOOKUP(B248,'FICHA DE PROJETO'!$A$216:$I$398,2,FALSE)),VLOOKUP(B248,'FICHA DE PROJETO'!$A$216:$I$398,2,FALSE),\"\")","v":""},null,null,null,null,null,null,null,null,"--"]
[null,"R38",{"$f":"IF(ISTEXT(VLOOKUP(B249,'FICHA DE PROJETO'!$A$216:$I$398,2,FALSE)),VLOOKUP(B249,'FICHA DE PROJETO'!$A$216:$I$398,2,FALSE),\"\")","v":""},null,null,null,null,null,null,null,null,"--"]
[null,"R39",{"$f":"IF(ISTEXT(VLOOKUP(B250,'FICHA DE PROJETO'!$A$216:$I$398,2,FALSE)),VLOOKUP(B250,'FICHA DE PROJETO'!$A$216:$I$398,2,FALSE),\"\")","v":""},null,null,null,null,null,null,null,null,"--"]
[null,"R40",{"$f":"IF(ISTEXT(VLOOKUP(B251,'FICHA DE PROJETO'!$A$216:$I$398,2,FALSE)),VLOOKUP(B251,'FICHA DE PROJETO'!$A$216:$I$398,2,FALSE),\"\")","v":""},null,null,null,null,null,null,null,null,"--"]
[null,"R41",{"$f":"IF(ISTEXT(VLOOKUP(B252,'FICHA DE PROJETO'!$A$216:$I$398,2,FALSE)),VLOOKUP(B252,'FICHA DE PROJETO'!$A$216:$I$398,2,FALSE),\"\")","v":""},null,null,null,null,null,null,null,null,"--"]
[null,"R42",{"$f":"IF(ISTEXT(VLOOKUP(B253,'FICHA DE PROJETO'!$A$216:$I$398,2,FALSE)),VLOOKUP(B253,'FICHA DE PROJETO'!$A$216:$I$398,2,FALSE),\"\")","v":""},null,null,null,null,null,null,null,null,"--"]
[null,"R43",{"$f":"IF(ISTEXT(VLOOKUP(B254,'FICHA DE PROJETO'!$A$216:$I$398,2,FALSE)),VLOOKUP(B254,'FICHA DE PROJETO'!$A$216:$I$398,2,FALSE),\"\")","v":""},null,null,null,null,null,null,null,null,"--"]
[null,"R44",{"$f":"IF(ISTEXT(VLOOKUP(B255,'FICHA DE PROJETO'!$A$216:$I$398,2,FALSE)),VLOOKUP(B255,'FICHA DE PROJETO'!$A$216:$I$398,2,FALSE),\"\")","v":""},null,null,null,null,null,null,null,null,"--"]
[null,"R45",{"$f":"IF(ISTEXT(VLOOKUP(B256,'FICHA DE PROJETO'!$A$216:$I$398,2,FALSE)),VLOOKUP(B256,'FICHA DE PROJETO'!$A$216:$I$398,2,FALSE),\"\")","v":""},null,null,null,null,null,null,null,null,"--"]
[null,"R46",{"$f":"IF(ISTEXT(VLOOKUP(B257,'FICHA DE PROJETO'!$A$216:$I$398,2,FALSE)),VLOOKUP(B257,'FICHA DE PROJETO'!$A$216:$I$398,2,FALSE),\"\")","v":""},null,null,null,null,null,null,null,null,"--"]
[null,"R47",{"$f":"IF(ISTEXT(VLOOKUP(B258,'FICHA DE PROJETO'!$A$216:$I$398,2,FALSE)),VLOOKUP(B258,'FICHA DE PROJETO'!$A$216:$I$398,2,FALSE),\"\")","v":""},null,null,null,null,null,null,null,null,"--"]
[null,"R48",{"$f":"IF(ISTEXT(VLOOKUP(B259,'FICHA DE PROJETO'!$A$216:$I$398,2,FALSE)),VLOOKUP(B259,'FICHA DE PROJETO'!$A$216:$I$398,2,FALSE),\"\")","v":""},null,null,null,null,null,null,null,null,"--"]
[null,"R49",{"$f":"IF(ISTEXT(VLOOKUP(B260,'FICHA DE PROJETO'!$A$216:$I$398,2,FALSE)),VLOOKUP(B260,'FICHA DE PROJETO'!$A$216:$I$398,2,FALSE),\"\")","v":""},null,null,null,null,null,null,null,null,"--"]
[null,"R50",{"$f":"IF(ISTEXT(VLOOKUP(B261,'FICHA DE PROJETO'!$A$216:$I$398,2,FALSE)),VLOOKUP(B261,'FICHA DE PROJETO'!$A$216:$I$398,2,FALSE),\"\")","v":""},null,null,null,null,null,null,null,null,"--"]
[null,"R51",{"$f":"IF(ISTEXT(VLOOKUP(B262,'FICHA DE PROJETO'!$A$216:$I$398,2,FALSE)),VLOOKUP(B262,'FICHA DE PROJETO'!$A$216:$I$398,2,FALSE),\"\")","v":""},null,null,null,null,null,null,null,null,"--"]
[null,"R52",{"$f":"IF(ISTEXT(VLOOKUP(B263,'FICHA DE PROJETO'!$A$216:$I$398,2,FALSE)),VLOOKUP(B263,'FICHA DE PROJETO'!$A$216:$I$398,2,FALSE),\"\")","v":""},null,null,null,null,null,null,null,null,"--"]
[null,"R53",{"$f":"IF(ISTEXT(VLOOKUP(B264,'FICHA DE PROJETO'!$A$216:$I$398,2,FALSE)),VLOOKUP(B264,'FICHA DE PROJETO'!$A$216:$I$398,2,FALSE),\"\")","v":""},null,null,null,null,null,null,null,null,"--"]
[null,"R54",{"$f":"IF(ISTEXT(VLOOKUP(B265,'FICHA DE PROJETO'!$A$216:$I$398,2,FALSE)),VLOOKUP(B265,'FICHA DE PROJETO'!$A$216:$I$398,2,FALSE),\"\")","v":""},null,null,null,null,null,null,null,null,"--"]
[null,"R55",{"$f":"IF(ISTEXT(VLOOKUP(B266,'FICHA DE PROJETO'!$A$216:$I$398,2,FALSE)),VLOOKUP(B266,'FICHA DE PROJETO'!$A$216:$I$398,2,FALSE),\"\")","v":""},null,null,null,null,null,null,null,null,"--"]
[null,"R56",{"$f":"IF(ISTEXT(VLOOKUP(B267,'FICHA DE PROJETO'!$A$216:$I$398,2,FALSE)),VLOOKUP(B267,'FICHA DE PROJETO'!$A$216:$I$398,2,FALSE),\"\")","v":""},null,null,null,null,null,null,null,null,"--"]
[null,"R57",{"$f":"IF(ISTEXT(VLOOKUP(B268,'FICHA DE PROJETO'!$A$216:$I$398,2,FALSE)),VLOOKUP(B268,'FICHA DE PROJETO'!$A$216:$I$398,2,FALSE),\"\")","v":""},null,null,null,null,null,null,null,null,"--"]
[null,"R58",{"$f":"IF(ISTEXT(VLOOKUP(B269,'FICHA DE PROJETO'!$A$216:$I$398,2,FALSE)),VLOOKUP(B269,'FICHA DE PROJETO'!$A$216:$I$398,2,FALSE),\"\")","v":""},null,null,null,null,null,null,null,null,"--"]
[null,"R59",{"$f":"IF(ISTEXT(VLOOKUP(B270,'FICHA DE PROJETO'!$A$216:$I$398,2,FALSE)),VLOOKUP(B270,'FICHA DE PROJETO'!$A$216:$I$398,2,FALSE),\"\")","v":""},null,null,null,null,null,null,null,null,"--"]
[null,"R60",{"$f":"IF(ISTEXT(VLOOKUP(B271,'FICHA DE PROJETO'!$A$216:$I$398,2,FALSE)),VLOOKUP(B271,'FICHA DE PROJETO'!$A$216:$I$398,2,FALSE),\"\")","v":""},null,null,null,null,null,null,null,null,"--"]
[null,"R61",{"$f":"IF(ISTEXT(VLOOKUP(B272,'FICHA DE PROJETO'!$A$216:$I$398,2,FALSE)),VLOOKUP(B272,'FICHA DE PROJETO'!$A$216:$I$398,2,FALSE),\"\")","v":""},null,null,null,null,null,null,null,null,"--"]
[null,"R62",{"$f":"IF(ISTEXT(VLOOKUP(B273,'FICHA DE PROJETO'!$A$216:$I$398,2,FALSE)),VLOOKUP(B273,'FICHA DE PROJETO'!$A$216:$I$398,2,FALSE),\"\")","v":""},null,null,null,null,null,null,null,null,"--"]
[null,"R63",{"$f":"IF(ISTEXT(VLOOKUP(B274,'FICHA DE PROJETO'!$A$216:$I$398,2,FALSE)),VLOOKUP(B274,'FICHA DE PROJETO'!$A$216:$I$398,2,FALSE),\"\")","v":""},null,null,null,null,null,null,null,null,"--"]
[null,"R64",{"$f":"IF(ISTEXT(VLOOKUP(B275,'FICHA DE PROJETO'!$A$216:$I$398,2,FALSE)),VLOOKUP(B275,'FICHA DE PROJETO'!$A$216:$I$398,2,FALSE),\"\")","v":""},null,null,null,null,null,null,null,null,"--"]
[null,"R65",{"$f":"IF(ISTEXT(VLOOKUP(B276,'FICHA DE PROJETO'!$A$216:$I$398,2,FALSE)),VLOOKUP(B276,'FICHA DE PROJETO'!$A$216:$I$398,2,FALSE),\"\")","v":""},null,null,null,null,null,null,null,null,"--"]
[null,"R66",{"$f":"IF(ISTEXT(VLOOKUP(B277,'FICHA DE PROJETO'!$A$216:$I$398,2,FALSE)),VLOOKUP(B277,'FICHA DE PROJETO'!$A$216:$I$398,2,FALSE),\"\")","v":""},null,null,null,null,null,null,null,null,"--"]
[null,"R67",{"$f":"IF(ISTEXT(VLOOKUP(B278,'FICHA DE PROJETO'!$A$216:$I$398,2,FALSE)),VLOOKUP(B278,'FICHA DE PROJETO'!$A$216:$I$398,2,FALSE),\"\")","v":""},null,null,null,null,null,null,null,null,"--"]
[null,"R68",{"$f":"IF(ISTEXT(VLOOKUP(B279,'FICHA DE PROJETO'!$A$216:$I$398,2,FALSE)),VLOOKUP(B279,'FICHA DE PROJETO'!$A$216:$I$398,2,FALSE),\"\")","v":""},null,null,null,null,null,null,null,null,"--"]
[null,"R69",{"$f":"IF(ISTEXT(VLOOKUP(B280,'FICHA DE PROJETO'!$A$216:$I$398,2,FALSE)),VLOOKUP(B280,'FICHA DE PROJETO'!$A$216:$I$398,2,FALSE),\"\")","v":""},null,null,null,null,null,null,null,null,"--"]
[null,"R70",{"$f":"IF(ISTEXT(VLOOKUP(B281,'FICHA DE PROJETO'!$A$216:$I$398,2,FALSE)),VLOOKUP(B281,'FICHA DE PROJETO'!$A$216:$I$398,2,FALSE),\"\")","v":""},null,null,null,null,null,null,null,null,"--"]
[null,"R71",{"$f":"IF(ISTEXT(VLOOKUP(B282,'FICHA DE PROJETO'!$A$216:$I$398,2,FALSE)),VLOOKUP(B282,'FICHA DE PROJETO'!$A$216:$I$398,2,FALSE),\"\")","v":""},null,null,null,null,null,null,null,null,"--"]
[null,"R72",{"$f":"IF(ISTEXT(VLOOKUP(B283,'FICHA DE PROJETO'!$A$216:$I$398,2,FALSE)),VLOOKUP(B283,'FICHA DE PROJETO'!$A$216:$I$398,2,FALSE),\"\")","v":""},null,null,null,null,null,null,null,null,"--"]
[null,"R73",{"$f":"IF(ISTEXT(VLOOKUP(B284,'FICHA DE PROJETO'!$A$216:$I$398,2,FALSE)),VLOOKUP(B284,'FICHA DE PROJETO'!$A$216:$I$398,2,FALSE),\"\")","v":""},null,null,null,null,null,null,null,null,"--"]
[null,"R74",{"$f":"IF(ISTEXT(VLOOKUP(B285,'FICHA DE PROJETO'!$A$216:$I$398,2,FALSE)),VLOOKUP(B285,'FICHA DE PROJETO'!$A$216:$I$398,2,FALSE),\"\")","v":""},null,null,null,null,null,null,null,null,"--"]
[null,"R75",{"$f":"IF(ISTEXT(VLOOKUP(B286,'FICHA DE PROJETO'!$A$216:$I$398,2,FALSE)),VLOOKUP(B286,'FICHA DE PROJETO'!$A$216:$I$398,2,FALSE),\"\")","v":""},null,null,null,null,null,null,null,null,"--"]
[null,"R76",{"$f":"IF(ISTEXT(VLOOKUP(B287,'FICHA DE PROJETO'!$A$216:$I$398,2,FALSE)),VLOOKUP(B287,'FICHA DE PROJETO'!$A$216:$I$398,2,FALSE),\"\")","v":""},null,null,null,null,null,null,null,null,"--"]
[null,"R77",{"$f":"IF(ISTEXT(VLOOKUP(B288,'FICHA DE PROJETO'!$A$216:$I$398,2,FALSE)),VLOOKUP(B288,'FICHA DE PROJETO'!$A$216:$I$398,2,FALSE),\"\")","v":""},null,null,null,null,null,null,null,null,{"$f":"IF(C288=\"\",\"--\",\"X\")","v":"--"}]
[null,"R78",{"$f":"IF(ISTEXT(VLOOKUP(B289,'FICHA DE PROJETO'!$A$216:$I$398,2,FALSE)),VLOOKUP(B289,'FICHA DE PROJETO'!$A$216:$I$398,2,FALSE),\"\")","v":""},null,null,null,null,null,null,null,null,"--"]
[null,"R79",{"$f":"IF(ISTEXT(VLOOKUP(B290,'FICHA DE PROJETO'!$A$216:$I$398,2,FALSE)),VLOOKUP(B290,'FICHA DE PROJETO'!$A$216:$I$398,2,FALSE),\"\")","v":""},null,null,null,null,null,null,null,null,"--"]
[null,"R80",{"$f":"IF(ISTEXT(VLOOKUP(B291,'FICHA DE PROJETO'!$A$216:$I$398,2,FALSE)),VLOOKUP(B291,'FICHA DE PROJETO'!$A$216:$I$398,2,FALSE),\"\")","v":""},null,null,null,null,null,null,null,null,"--"]
[null,"R81",{"$f":"IF(ISTEXT(VLOOKUP(B292,'FICHA DE PROJETO'!$A$216:$I$398,2,FALSE)),VLOOKUP(B292,'FICHA DE PROJETO'!$A$216:$I$398,2,FALSE),\"\")","v":""},null,null,null,null,null,null,null,null,"--"]
[null,"R82",{"$f":"IF(ISTEXT(VLOOKUP(B293,'FICHA DE PROJETO'!$A$216:$I$398,2,FALSE)),VLOOKUP(B293,'FICHA DE PROJETO'!$A$216:$I$398,2,FALSE),\"\")","v":""},null,null,null,null,null,null,null,null,"--"]
[null,"R83",{"$f":"IF(ISTEXT(VLOOKUP(B294,'FICHA DE PROJETO'!$A$216:$I$398,2,FALSE)),VLOOKUP(B294,'FICHA DE PROJETO'!$A$216:$I$398,2,FALSE),\"\")","v":""},null,null,null,null,null,null,null,null,"--"]
[null,"R84",{"$f":"IF(ISTEXT(VLOOKUP(B295,'FICHA DE PROJETO'!$A$216:$I$398,2,FALSE)),VLOOKUP(B295,'FICHA DE PROJETO'!$A$216:$I$398,2,FALSE),\"\")","v":""},null,null,null,null,null,null,null,null,"--"]
[null,"R85",{"$f":"IF(ISTEXT(VLOOKUP(B296,'FICHA DE PROJETO'!$A$216:$I$398,2,FALSE)),VLOOKUP(B296,'FICHA DE PROJETO'!$A$216:$I$398,2,FALSE),\"\")","v":""},null,null,null,null,null,null,null,null,"--"]
[null,"R86",{"$f":"IF(ISTEXT(VLOOKUP(B297,'FICHA DE PROJETO'!$A$216:$I$398,2,FALSE)),VLOOKUP(B297,'FICHA DE PROJETO'!$A$216:$I$398,2,FALSE),\"\")","v":""},null,null,null,null,null,null,null,null,"--"]
[null,"R87",{"$f":"IF(ISTEXT(VLOOKUP(B298,'FICHA DE PROJETO'!$A$216:$I$398,2,FALSE)),VLOOKUP(B298,'FICHA DE PROJETO'!$A$216:$I$398,2,FALSE),\"\")","v":""},null,null,null,null,null,null,null,null,"--"]
[null,"R88",{"$f":"IF(ISTEXT(VLOOKUP(B299,'FICHA DE PROJETO'!$A$216:$I$398,2,FALSE)),VLOOKUP(B299,'FICHA DE PROJETO'!$A$216:$I$398,2,FALSE),\"\")","v":""},null,null,null,null,null,null,null,null,"--"]
[null,"R89",{"$f":"IF(ISTEXT(VLOOKUP(B300,'FICHA DE PROJETO'!$A$216:$I$398,2,FALSE)),VLOOKUP(B300,'FICHA DE PROJETO'!$A$216:$I$398,2,FALSE),\"\")","v":""},null,null,null,null,null,null,null,null,"--"]
[null,"R90",{"$f":"IF(ISTEXT(VLOOKUP(B301,'FICHA DE PROJETO'!$A$216:$I$398,2,FALSE)),VLOOKUP(B301,'FICHA DE PROJETO'!$A$216:$I$398,2,FALSE),\"\")","v":""},null,null,null,null,null,null,null,null,"--"]
[null,"R91",{"$f":"IF(ISTEXT(VLOOKUP(B302,'FICHA DE PROJETO'!$A$216:$I$398,2,FALSE)),VLOOKUP(B302,'FICHA DE PROJETO'!$A$216:$I$398,2,FALSE),\"\")","v":""},null,null,null,null,null,null,null,null,"--"]
[null,"R92",{"$f":"IF(ISTEXT(VLOOKUP(B303,'FICHA DE PROJETO'!$A$216:$I$398,2,FALSE)),VLOOKUP(B303,'FICHA DE PROJETO'!$A$216:$I$398,2,FALSE),\"\")","v":""},null,null,null,null,null,null,null,null,"--"]
[null,"R93",{"$f":"IF(ISTEXT(VLOOKUP(B304,'FICHA DE PROJETO'!$A$216:$I$398,2,FALSE)),VLOOKUP(B304,'FICHA DE PROJETO'!$A$216:$I$398,2,FALSE),\"\")","v":""},null,null,null,null,null,null,null,null,"--"]
[null,"R94",{"$f":"IF(ISTEXT(VLOOKUP(B305,'FICHA DE PROJETO'!$A$216:$I$398,2,FALSE)),VLOOKUP(B305,'FICHA DE PROJETO'!$A$216:$I$398,2,FALSE),\"\")","v":""},null,null,null,null,null,null,null,null,"--"]
[null,"R95",{"$f":"IF(ISTEXT(VLOOKUP(B306,'FICHA DE PROJETO'!$A$216:$I$398,2,FALSE)),VLOOKUP(B306,'FICHA DE PROJETO'!$A$216:$I$398,2,FALSE),\"\")","v":""},null,null,null,null,null,null,null,null,"--"]
[null,"R96",{"$f":"IF(ISTEXT(VLOOKUP(B307,'FICHA DE PROJETO'!$A$216:$I$398,2,FALSE)),VLOOKUP(B307,'FICHA DE PROJETO'!$A$216:$I$398,2,FALSE),\"\")","v":""},null,null,null,null,null,null,null,null,"--"]
[null,"R97",{"$f":"IF(ISTEXT(VLOOKUP(B308,'FICHA DE PROJETO'!$A$216:$I$398,2,FALSE)),VLOOKUP(B308,'FICHA DE PROJETO'!$A$216:$I$398,2,FALSE),\"\")","v":""},null,null,null,null,null,null,null,null,"--"]
[null,"R98",{"$f":"IF(ISTEXT(VLOOKUP(B309,'FICHA DE PROJETO'!$A$216:$I$398,2,FALSE)),VLOOKUP(B309,'FICHA DE PROJETO'!$A$216:$I$398,2,FALSE),\"\")","v":""},null,null,null,null,null,null,null,null,"--"]
[null,"R99",{"$f":"IF(ISTEXT(VLOOKUP(B310,'FICHA DE PROJETO'!$A$216:$I$398,2,FALSE)),VLOOKUP(B310,'FICHA DE PROJETO'!$A$216:$I$398,2,FALSE),\"\")","v":""},null,null,null,null,null,null,null,null,"--"]
[null,"R100",{"$f":"IF(ISTEXT(VLOOKUP(B311,'FICHA DE PROJETO'!$A$216:$I$398,2,FALSE)),VLOOKUP(B311,'FICHA DE PROJETO'!$A$216:$I$398,2,FALSE),\"\")","v":""},null,null,null,null,null,null,null,null,"--"]
[null,"R101",{"$f":"IF(ISTEXT(VLOOKUP(B312,'FICHA DE PROJETO'!$A$216:$I$398,2,FALSE)),VLOOKUP(B312,'FICHA DE PROJETO'!$A$216:$I$398,2,FALSE),\"\")","v":""},null,null,null,null,null,null,null,null,"--"]
[null,"R102",{"$f":"IF(ISTEXT(VLOOKUP(B313,'FICHA DE PROJETO'!$A$216:$I$398,2,FALSE)),VLOOKUP(B313,'FICHA DE PROJETO'!$A$216:$I$398,2,FALSE),\"\")","v":""},null,null,null,null,null,null,null,null,"--"]
[null,"R103",{"$f":"IF(ISTEXT(VLOOKUP(B314,'FICHA DE PROJETO'!$A$216:$I$398,2,FALSE)),VLOOKUP(B314,'FICHA DE PROJETO'!$A$216:$I$398,2,FALSE),\"\")","v":""},null,null,null,null,null,null,null,null,"--"]
[null,"R104",{"$f":"IF(ISTEXT(VLOOKUP(B315,'FICHA DE PROJETO'!$A$216:$I$398,2,FALSE)),VLOOKUP(B315,'FICHA DE PROJETO'!$A$216:$I$398,2,FALSE),\"\")","v":""},null,null,null,null,null,null,null,null,"--"]
[null,"R105",{"$f":"IF(ISTEXT(VLOOKUP(B316,'FICHA DE PROJETO'!$A$216:$I$398,2,FALSE)),VLOOKUP(B316,'FICHA DE PROJETO'!$A$216:$I$398,2,FALSE),\"\")","v":""},null,null,null,null,null,null,null,null,"--"]
[null,"R106",{"$f":"IF(ISTEXT(VLOOKUP(B317,'FICHA DE PROJETO'!$A$216:$I$398,2,FALSE)),VLOOKUP(B317,'FICHA DE PROJETO'!$A$216:$I$398,2,FALSE),\"\")","v":""},null,null,null,null,null,null,null,null,"--"]
[null,"R107",{"$f":"IF(ISTEXT(VLOOKUP(B318,'FICHA DE PROJETO'!$A$216:$I$398,2,FALSE)),VLOOKUP(B318,'FICHA DE PROJETO'!$A$216:$I$398,2,FALSE),\"\")","v":""},null,null,null,null,null,null,null,null,"--"]
[null,"R108",{"$f":"IF(ISTEXT(VLOOKUP(B319,'FICHA DE PROJETO'!$A$216:$I$398,2,FALSE)),VLOOKUP(B319,'FICHA DE PROJETO'!$A$216:$I$398,2,FALSE),\"\")","v":""},null,null,null,null,null,null,null,null,"--"]
[null,"R109",{"$f":"IF(ISTEXT(VLOOKUP(B320,'FICHA DE PROJETO'!$A$216:$I$398,2,FALSE)),VLOOKUP(B320,'FICHA DE PROJETO'!$A$216:$I$398,2,FALSE),\"\")","v":""},null,null,null,null,null,null,null,null,"--"]
[null,"R110",{"$f":"IF(ISTEXT(VLOOKUP(B321,'FICHA DE PROJETO'!$A$216:$I$398,2,FALSE)),VLOOKUP(B321,'FICHA DE PROJETO'!$A$216:$I$398,2,FALSE),\"\")","v":""},null,null,null,null,null,null,null,null,"--"]
[null,"R111",{"$f":"IF(ISTEXT(VLOOKUP(B322,'FICHA DE PROJETO'!$A$216:$I$398,2,FALSE)),VLOOKUP(B322,'FICHA DE PROJETO'!$A$216:$I$398,2,FALSE),\"\")","v":""},null,null,null,null,null,null,null,null,"--"]
[null,"R112",{"$f":"IF(ISTEXT(VLOOKUP(B323,'FICHA DE PROJETO'!$A$216:$I$398,2,FALSE)),VLOOKUP(B323,'FICHA DE PROJETO'!$A$216:$I$398,2,FALSE),\"\")","v":""},null,null,null,null,null,null,null,null,"--"]
[null,"R113",{"$f":"IF(ISTEXT(VLOOKUP(B324,'FICHA DE PROJETO'!$A$216:$I$398,2,FALSE)),VLOOKUP(B324,'FICHA DE PROJETO'!$A$216:$I$398,2,FALSE),\"\")","v":""},null,null,null,null,null,null,null,null,"--"]
[null,"R114",{"$f":"IF(ISTEXT(VLOOKUP(B325,'FICHA DE PROJETO'!$A$216:$I$398,2,FALSE)),VLOOKUP(B325,'FICHA DE PROJETO'!$A$216:$I$398,2,FALSE),\"\")","v":""},null,null,null,null,null,null,null,null,"--"]
[null,"R115",{"$f":"IF(ISTEXT(VLOOKUP(B326,'FICHA DE PROJETO'!$A$216:$I$398,2,FALSE)),VLOOKUP(B326,'FICHA DE PROJETO'!$A$216:$I$398,2,FALSE),\"\")","v":""},null,null,null,null,null,null,null,null,"--"]
[null,"R116",{"$f":"IF(ISTEXT(VLOOKUP(B327,'FICHA DE PROJETO'!$A$216:$I$398,2,FALSE)),VLOOKUP(B327,'FICHA DE PROJETO'!$A$216:$I$398,2,FALSE),\"\")","v":""},null,null,null,null,null,null,null,null,"--"]
[null,"R117",{"$f":"IF(ISTEXT(VLOOKUP(B328,'FICHA DE PROJETO'!$A$216:$I$398,2,FALSE)),VLOOKUP(B328,'FICHA DE PROJETO'!$A$216:$I$398,2,FALSE),\"\")","v":""},null,null,null,null,null,null,null,null,"--"]
[null,"R118",{"$f":"IF(ISTEXT(VLOOKUP(B329,'FICHA DE PROJETO'!$A$216:$I$398,2,FALSE)),VLOOKUP(B329,'FICHA DE PROJETO'!$A$216:$I$398,2,FALSE),\"\")","v":""},null,null,null,null,null,null,null,null,"--"]
[null,"R119",{"$f":"IF(ISTEXT(VLOOKUP(B330,'FICHA DE PROJETO'!$A$216:$I$398,2,FALSE)),VLOOKUP(B330,'FICHA DE PROJETO'!$A$216:$I$398,2,FALSE),\"\")","v":""},null,null,null,null,null,null,null,null,"--"]
[null,"R120",{"$f":"IF(ISTEXT(VLOOKUP(B331,'FICHA DE PROJETO'!$A$216:$I$398,2,FALSE)),VLOOKUP(B331,'FICHA DE PROJETO'!$A$216:$I$398,2,FALSE),\"\")","v":""},null,null,null,null,null,null,null,null,"--"]
[null,"R121",{"$f":"IF(ISTEXT(VLOOKUP(B332,'FICHA DE PROJETO'!$A$216:$I$398,2,FALSE)),VLOOKUP(B332,'FICHA DE PROJETO'!$A$216:$I$398,2,FALSE),\"\")","v":""},null,null,null,null,null,null,null,null,"--"]
[null,"R122",{"$f":"IF(ISTEXT(VLOOKUP(B333,'FICHA DE PROJETO'!$A$216:$I$398,2,FALSE)),VLOOKUP(B333,'FICHA DE PROJETO'!$A$216:$I$398,2,FALSE),\"\")","v":""},null,null,null,null,null,null,null,null,"--"]
[null,"R123",{"$f":"IF(ISTEXT(VLOOKUP(B334,'FICHA DE PROJETO'!$A$216:$I$398,2,FALSE)),VLOOKUP(B334,'FICHA DE PROJETO'!$A$216:$I$398,2,FALSE),\"\")","v":""},null,null,null,null,null,null,null,null,"--"]
[null,"R124",{"$f":"IF(ISTEXT(VLOOKUP(B335,'FICHA DE PROJETO'!$A$216:$I$398,2,FALSE)),VLOOKUP(B335,'FICHA DE PROJETO'!$A$216:$I$398,2,FALSE),\"\")","v":""},null,null,null,null,null,null,null,null,"--"]
[null,"R125",{"$f":"IF(ISTEXT(VLOOKUP(B336,'FICHA DE PROJETO'!$A$216:$I$398,2,FALSE)),VLOOKUP(B336,'FICHA DE PROJETO'!$A$216:$I$398,2,FALSE),\"\")","v":""},null,null,null,null,null,null,null,null,"--"]
[null,"R126",{"$f":"IF(ISTEXT(VLOOKUP(B337,'FICHA DE PROJETO'!$A$216:$I$398,2,FALSE)),VLOOKUP(B337,'FICHA DE PROJETO'!$A$216:$I$398,2,FALSE),\"\")","v":""},null,null,null,null,null,null,null,null,"--"]
[null,"R127",{"$f":"IF(ISTEXT(VLOOKUP(B338,'FICHA DE PROJETO'!$A$216:$I$398,2,FALSE)),VLOOKUP(B338,'FICHA DE PROJETO'!$A$216:$I$398,2,FALSE),\"\")","v":""},null,null,null,null,null,null,null,null,"--"]
[null,"R128",{"$f":"IF(ISTEXT(VLOOKUP(B339,'FICHA DE PROJETO'!$A$216:$I$398,2,FALSE)),VLOOKUP(B339,'FICHA DE PROJETO'!$A$216:$I$398,2,FALSE),\"\")","v":""},null,null,null,null,null,null,null,null,"--"]
[null,"R129",{"$f":"IF(ISTEXT(VLOOKUP(B340,'FICHA DE PROJETO'!$A$216:$I$398,2,FALSE)),VLOOKUP(B340,'FICHA DE PROJETO'!$A$216:$I$398,2,FALSE),\"\")","v":""},null,null,null,null,null,null,null,null,"--"]
[null,"R130",{"$f":"IF(ISTEXT(VLOOKUP(B341,'FICHA DE PROJETO'!$A$216:$I$398,2,FALSE)),VLOOKUP(B341,'FICHA DE PROJETO'!$A$216:$I$398,2,FALSE),\"\")","v":""},null,null,null,null,null,null,null,null,"--"]
[null,"R131",{"$f":"IF(ISTEXT(VLOOKUP(B342,'FICHA DE PROJETO'!$A$216:$I$398,2,FALSE)),VLOOKUP(B342,'FICHA DE PROJETO'!$A$216:$I$398,2,FALSE),\"\")","v":""},null,null,null,null,null,null,null,null,"--"]
[null,"R132",{"$f":"IF(ISTEXT(VLOOKUP(B343,'FICHA DE PROJETO'!$A$216:$I$398,2,FALSE)),VLOOKUP(B343,'FICHA DE PROJETO'!$A$216:$I$398,2,FALSE),\"\")","v":""},null,null,null,null,null,null,null,null,"--"]
[null,"R133",{"$f":"IF(ISTEXT(VLOOKUP(B344,'FICHA DE PROJETO'!$A$216:$I$398,2,FALSE)),VLOOKUP(B344,'FICHA DE PROJETO'!$A$216:$I$398,2,FALSE),\"\")","v":""},null,null,null,null,null,null,null,null,"--"]
[null,"R134",{"$f":"IF(ISTEXT(VLOOKUP(B345,'FICHA DE PROJETO'!$A$216:$I$398,2,FALSE)),VLOOKUP(B345,'FICHA DE PROJETO'!$A$216:$I$398,2,FALSE),\"\")","v":""},null,null,null,null,null,null,null,null,"--"]
[null,"R135",{"$f":"IF(ISTEXT(VLOOKUP(B346,'FICHA DE PROJETO'!$A$216:$I$398,2,FALSE)),VLOOKUP(B346,'FICHA DE PROJETO'!$A$216:$I$398,2,FALSE),\"\")","v":""},null,null,null,null,null,null,null,null,"--"]
[null,"R136",{"$f":"IF(ISTEXT(VLOOKUP(B347,'FICHA DE PROJETO'!$A$216:$I$398,2,FALSE)),VLOOKUP(B347,'FICHA DE PROJETO'!$A$216:$I$398,2,FALSE),\"\")","v":""},null,null,null,null,null,null,null,null,"--"]
[null,"R137",{"$f":"IF(ISTEXT(VLOOKUP(B348,'FICHA DE PROJETO'!$A$216:$I$398,2,FALSE)),VLOOKUP(B348,'FICHA DE PROJETO'!$A$216:$I$398,2,FALSE),\"\")","v":""},null,null,null,null,null,null,null,null,"--"]
[null,"R138",{"$f":"IF(ISTEXT(VLOOKUP(B349,'FICHA DE PROJETO'!$A$216:$I$398,2,FALSE)),VLOOKUP(B349,'FICHA DE PROJETO'!$A$216:$I$398,2,FALSE),\"\")","v":""},null,null,null,null,null,null,null,null,"--"]
[null,"R139",{"$f":"IF(ISTEXT(VLOOKUP(B350,'FICHA DE PROJETO'!$A$216:$I$398,2,FALSE)),VLOOKUP(B350,'FICHA DE PROJETO'!$A$216:$I$398,2,FALSE),\"\")","v":""},null,null,null,null,null,null,null,null,"--"]
[null,"R140",{"$f":"IF(ISTEXT(VLOOKUP(B351,'FICHA DE PROJETO'!$A$216:$I$398,2,FALSE)),VLOOKUP(B351,'FICHA DE PROJETO'!$A$216:$I$398,2,FALSE),\"\")","v":""},null,null,null,null,null,null,null,null,"--"]
[null,"R141",{"$f":"IF(ISTEXT(VLOOKUP(B352,'FICHA DE PROJETO'!$A$216:$I$398,2,FALSE)),VLOOKUP(B352,'FICHA DE PROJETO'!$A$216:$I$398,2,FALSE),\"\")","v":""},null,null,null,null,null,null,null,null,{"$f":"IF(C352=\"\",\"--\",\"X\")","v":"--"}]
[null,"R142",{"$f":"IF(ISTEXT(VLOOKUP(B353,'FICHA DE PROJETO'!$A$216:$I$398,2,FALSE)),VLOOKUP(B353,'FICHA DE PROJETO'!$A$216:$I$398,2,FALSE),\"\")","v":""},null,null,null,null,null,null,null,null,"--"]
[null,"R143",{"$f":"IF(ISTEXT(VLOOKUP(B354,'FICHA DE PROJETO'!$A$216:$I$398,2,FALSE)),VLOOKUP(B354,'FICHA DE PROJETO'!$A$216:$I$398,2,FALSE),\"\")","v":""},null,null,null,null,null,null,null,null,"--"]
[null,"R144",{"$f":"IF(ISTEXT(VLOOKUP(B355,'FICHA DE PROJETO'!$A$216:$I$398,2,FALSE)),VLOOKUP(B355,'FICHA DE PROJETO'!$A$216:$I$398,2,FALSE),\"\")","v":""},null,null,null,null,null,null,null,null,"--"]
[null,"R145",{"$f":"IF(ISTEXT(VLOOKUP(B356,'FICHA DE PROJETO'!$A$216:$I$398,2,FALSE)),VLOOKUP(B356,'FICHA DE PROJETO'!$A$216:$I$398,2,FALSE),\"\")","v":""},null,null,null,null,null,null,null,null,"--"]
[null,"R146",{"$f":"IF(ISTEXT(VLOOKUP(B357,'FICHA DE PROJETO'!$A$216:$I$398,2,FALSE)),VLOOKUP(B357,'FICHA DE PROJETO'!$A$216:$I$398,2,FALSE),\"\")","v":""},null,null,null,null,null,null,null,null,"--"]
[null,"R147",{"$f":"IF(ISTEXT(VLOOKUP(B358,'FICHA DE PROJETO'!$A$216:$I$398,2,FALSE)),VLOOKUP(B358,'FICHA DE PROJETO'!$A$216:$I$398,2,FALSE),\"\")","v":""},null,null,null,null,null,null,null,null,"--"]
[null,"R148",{"$f":"IF(ISTEXT(VLOOKUP(B359,'FICHA DE PROJETO'!$A$216:$I$398,2,FALSE)),VLOOKUP(B359,'FICHA DE PROJETO'!$A$216:$I$398,2,FALSE),\"\")","v":""},null,null,null,null,null,null,null,null,"--"]
[null,"R149",{"$f":"IF(ISTEXT(VLOOKUP(B360,'FICHA DE PROJETO'!$A$216:$I$398,2,FALSE)),VLOOKUP(B360,'FICHA DE PROJETO'!$A$216:$I$398,2,FALSE),\"\")","v":""},null,null,null,null,null,null,null,null,"--"]
[null,"R150",{"$f":"IF(ISTEXT(VLOOKUP(B361,'FICHA DE PROJETO'!$A$216:$I$398,2,FALSE)),VLOOKUP(B361,'FICHA DE PROJETO'!$A$216:$I$398,2,FALSE),\"\")","v":""},null,null,null,null,null,null,null,null,"--"]
[null,"R151",{"$f":"IF(ISTEXT(VLOOKUP(B362,'FICHA DE PROJETO'!$A$216:$I$398,2,FALSE)),VLOOKUP(B362,'FICHA DE PROJETO'!$A$216:$I$398,2,FALSE),\"\")","v":""},null,null,null,null,null,null,null,null,"--"]
[null,"R152",{"$f":"IF(ISTEXT(VLOOKUP(B363,'FICHA DE PROJETO'!$A$216:$I$398,2,FALSE)),VLOOKUP(B363,'FICHA DE PROJETO'!$A$216:$I$398,2,FALSE),\"\")","v":""},null,null,null,null,null,null,null,null,"--"]
[null,"R153",{"$f":"IF(ISTEXT(VLOOKUP(B364,'FICHA DE PROJETO'!$A$216:$I$398,2,FALSE)),VLOOKUP(B364,'FICHA DE PROJETO'!$A$216:$I$398,2,FALSE),\"\")","v":""},null,null,null,null,null,null,null,null,"--"]
[null,"R154",{"$f":"IF(ISTEXT(VLOOKUP(B365,'FICHA DE PROJETO'!$A$216:$I$398,2,FALSE)),VLOOKUP(B365,'FICHA DE PROJETO'!$A$216:$I$398,2,FALSE),\"\")","v":""},null,null,null,null,null,null,null,null,"--"]
[null,"R155",{"$f":"IF(ISTEXT(VLOOKUP(B366,'FICHA DE PROJETO'!$A$216:$I$398,2,FALSE)),VLOOKUP(B366,'FICHA DE PROJETO'!$A$216:$I$398,2,FALSE),\"\")","v":""},null,null,null,null,null,null,null,null,"--"]
[null,"R156",{"$f":"IF(ISTEXT(VLOOKUP(B367,'FICHA DE PROJETO'!$A$216:$I$398,2,FALSE)),VLOOKUP(B367,'FICHA DE PROJETO'!$A$216:$I$398,2,FALSE),\"\")","v":""},null,null,null,null,null,null,null,null,"--"]
[null,"R157",{"$f":"IF(ISTEXT(VLOOKUP(B368,'FICHA DE PROJETO'!$A$216:$I$398,2,FALSE)),VLOOKUP(B368,'FICHA DE PROJETO'!$A$216:$I$398,2,FALSE),\"\")","v":""},null,null,null,null,null,null,null,null,"--"]
[null,"R158",{"$f":"IF(ISTEXT(VLOOKUP(B369,'FICHA DE PROJETO'!$A$216:$I$398,2,FALSE)),VLOOKUP(B369,'FICHA DE PROJETO'!$A$216:$I$398,2,FALSE),\"\")","v":""},null,null,null,null,null,null,null,null,"--"]
[null,"R159",{"$f":"IF(ISTEXT(VLOOKUP(B370,'FICHA DE PROJETO'!$A$216:$I$398,2,FALSE)),VLOOKUP(B370,'FICHA DE PROJETO'!$A$216:$I$398,2,FALSE),\"\")","v":""},null,null,null,null,null,null,null,null,"--"]
[null,"R160",{"$f":"IF(ISTEXT(VLOOKUP(B371,'FICHA DE PROJETO'!$A$216:$I$398,2,FALSE)),VLOOKUP(B371,'FICHA DE PROJETO'!$A$216:$I$398,2,FALSE),\"\")","v":""},null,null,null,null,null,null,null,null,"--"]
[null,"R161",{"$f":"IF(ISTEXT(VLOOKUP(B372,'FICHA DE PROJETO'!$A$216:$I$398,2,FALSE)),VLOOKUP(B372,'FICHA DE PROJETO'!$A$216:$I$398,2,FALSE),\"\")","v":""},null,null,null,null,null,null,null,null,"--"]
[null,"R162",{"$f":"IF(ISTEXT(VLOOKUP(B373,'FICHA DE PROJETO'!$A$216:$I$398,2,FALSE)),VLOOKUP(B373,'FICHA DE PROJETO'!$A$216:$I$398,2,FALSE),\"\")","v":""},null,null,null,null,null,null,null,null,"--"]
[null,"R163",{"$f":"IF(ISTEXT(VLOOKUP(B374,'FICHA DE PROJETO'!$A$216:$I$398,2,FALSE)),VLOOKUP(B374,'FICHA DE PROJETO'!$A$216:$I$398,2,FALSE),\"\")","v":""},null,null,null,null,null,null,null,null,"--"]
[null,"R164",{"$f":"IF(ISTEXT(VLOOKUP(B375,'FICHA DE PROJETO'!$A$216:$I$398,2,FALSE)),VLOOKUP(B375,'FICHA DE PROJETO'!$A$216:$I$398,2,FALSE),\"\")","v":""},null,null,null,null,null,null,null,null,"--"]
[null,"R165",{"$f":"IF(ISTEXT(VLOOKUP(B376,'FICHA DE PROJETO'!$A$216:$I$398,2,FALSE)),VLOOKUP(B376,'FICHA DE PROJETO'!$A$216:$I$398,2,FALSE),\"\")","v":""},null,null,null,null,null,null,null,null,"--"]
[null,"R166",{"$f":"IF(ISTEXT(VLOOKUP(B377,'FICHA DE PROJETO'!$A$216:$I$398,2,FALSE)),VLOOKUP(B377,'FICHA DE PROJETO'!$A$216:$I$398,2,FALSE),\"\")","v":""},null,null,null,null,null,null,null,null,"--"]
[null,"R167",{"$f":"IF(ISTEXT(VLOOKUP(B378,'FICHA DE PROJETO'!$A$216:$I$398,2,FALSE)),VLOOKUP(B378,'FICHA DE PROJETO'!$A$216:$I$398,2,FALSE),\"\")","v":""},null,null,null,null,null,null,null,null,"--"]
[null,"R168",{"$f":"IF(ISTEXT(VLOOKUP(B379,'FICHA DE PROJETO'!$A$216:$I$398,2,FALSE)),VLOOKUP(B379,'FICHA DE PROJETO'!$A$216:$I$398,2,FALSE),\"\")","v":""},null,null,null,null,null,null,null,null,"--"]
[null,"R169",{"$f":"IF(ISTEXT(VLOOKUP(B380,'FICHA DE PROJETO'!$A$216:$I$398,2,FALSE)),VLOOKUP(B380,'FICHA DE PROJETO'!$A$216:$I$398,2,FALSE),\"\")","v":""},null,null,null,null,null,null,null,null,"--"]
[null,"R170",{"$f":"IF(ISTEXT(VLOOKUP(B381,'FICHA DE PROJETO'!$A$216:$I$398,2,FALSE)),VLOOKUP(B381,'FICHA DE PROJETO'!$A$216:$I$398,2,FALSE),\"\")","v":""},null,null,null,null,null,null,null,null,"--"]
[null,"R171",{"$f":"IF(ISTEXT(VLOOKUP(B382,'FICHA DE PROJETO'!$A$216:$I$398,2,FALSE)),VLOOKUP(B382,'FICHA DE PROJETO'!$A$216:$I$398,2,FALSE),\"\")","v":""},null,null,null,null,null,null,null,null,"--"]
[null,"R172",{"$f":"IF(ISTEXT(VLOOKUP(B383,'FICHA DE PROJETO'!$A$216:$I$398,2,FALSE)),VLOOKUP(B383,'FICHA DE PROJETO'!$A$216:$I$398,2,FALSE),\"\")","v":""},null,null,null,null,null,null,null,null,"--"]
[null,"R173",{"$f":"IF(ISTEXT(VLOOKUP(B384,'FICHA DE PROJETO'!$A$216:$I$398,2,FALSE)),VLOOKUP(B384,'FICHA DE PROJETO'!$A$216:$I$398,2,FALSE),\"\")","v":""},null,null,null,null,null,null,null,null,"--"]
[null,"R174",{"$f":"IF(ISTEXT(VLOOKUP(B385,'FICHA DE PROJETO'!$A$216:$I$398,2,FALSE)),VLOOKUP(B385,'FICHA DE PROJETO'!$A$216:$I$398,2,FALSE),\"\")","v":""},null,null,null,null,null,null,null,null,"--"]
[null,"R175",{"$f":"IF(ISTEXT(VLOOKUP(B386,'FICHA DE PROJETO'!$A$216:$I$398,2,FALSE)),VLOOKUP(B386,'FICHA DE PROJETO'!$A$216:$I$398,2,FALSE),\"\")","v":""},null,null,null,null,null,null,null,null,"--"]
[null,"R176",{"$f":"IF(ISTEXT(VLOOKUP(B387,'FICHA DE PROJETO'!$A$216:$I$398,2,FALSE)),VLOOKUP(B387,'FICHA DE PROJETO'!$A$216:$I$398,2,FALSE),\"\")","v":""},null,null,null,null,null,null,null,null,"--"]
[null,"R177",{"$f":"IF(ISTEXT(VLOOKUP(B388,'FICHA DE PROJETO'!$A$216:$I$398,2,FALSE)),VLOOKUP(B388,'FICHA DE PROJETO'!$A$216:$I$398,2,FALSE),\"\")","v":""},null,null,null,null,null,null,null,null,"--"]
[null,"R178",{"$f":"IF(ISTEXT(VLOOKUP(B389,'FICHA DE PROJETO'!$A$216:$I$398,2,FALSE)),VLOOKUP(B389,'FICHA DE PROJETO'!$A$216:$I$398,2,FALSE),\"\")","v":""},null,null,null,null,null,null,null,null,"--"]
[null,"R179",{"$f":"IF(ISTEXT(VLOOKUP(B390,'FICHA DE PROJETO'!$A$216:$I$398,2,FALSE)),VLOOKUP(B390,'FICHA DE PROJETO'!$A$216:$I$398,2,FALSE),\"\")","v":""},null,null,null,null,null,null,null,null,"--"]
[null,"R180",{"$f":"IF(ISTEXT(VLOOKUP(B391,'FICHA DE PROJETO'!$A$216:$I$398,2,FALSE)),VLOOKUP(B391,'FICHA DE PROJETO'!$A$216:$I$398,2,FALSE),\"\")","v":""},null,null,null,null,null,null,null,null,"--"]
[null,null,null,null,null,null,null,null,null,null,null,{"$f":"IF(('FICHA DE PROJETO'!$K$398=\"X\"),\"X\",\"---\")","v":"---"}]
[{"$f":"IF(('FICHA DE PROJETO'!K398=\"X\"),\"Lote 03\",\"---\")","v":"---"},null,null,null,null,null,null,null,null,null,null,{"$f":"IF(('FICHA DE PROJETO'!$K$398=\"X\"),\"X\",\"---\")","v":"---"}]
[null,"R01",{"$f":"IF(ISTEXT(VLOOKUP(B394,'FICHA DE PROJETO'!$A$399:$I$579,2,FALSE)),VLOOKUP(B394,'FICHA DE PROJETO'!$A$399:$I$579,2,FALSE),\"\")","v":""},null,null,null,null,null,null,null,null,"--"]
[null,"R02",{"$f":"IF(ISTEXT(VLOOKUP(B395,'FICHA DE PROJETO'!$A$399:$I$579,2,FALSE)),VLOOKUP(B395,'FICHA DE PROJETO'!$A$399:$I$579,2,FALSE),\"\")","v":""},null,null,null,null,null,null,null,null,"--"]
[null,"R03",{"$f":"IF(ISTEXT(VLOOKUP(B396,'FICHA DE PROJETO'!$A$399:$I$579,2,FALSE)),VLOOKUP(B396,'FICHA DE PROJETO'!$A$399:$I$579,2,FALSE),\"\")","v":""},null,null,null,null,null,null,null,null,"--"]
[null,"R04",{"$f":"IF(ISTEXT(VLOOKUP(B397,'FICHA DE PROJETO'!$A$399:$I$579,2,FALSE)),VLOOKUP(B397,'FICHA DE PROJETO'!$A$399:$I$579,2,FALSE),\"\")","v":""},null,null,null,null,null,null,null,null,"--"]
[null,"R05",{"$f":"IF(ISTEXT(VLOOKUP(B398,'FICHA DE PROJETO'!$A$399:$I$579,2,FALSE)),VLOOKUP(B398,'FICHA DE PROJETO'!$A$399:$I$579,2,FALSE),\"\")","v":""},null,null,null,null,null,null,null,null,"--"]
[null,"R06",{"$f":"IF(ISTEXT(VLOOKUP(B399,'FICHA DE PROJETO'!$A$399:$I$579,2,FALSE)),VLOOKUP(B399,'FICHA DE PROJETO'!$A$399:$I$579,2,FALSE),\"\")","v":""},null,null,null,null,null,null,null,null,"--"]
[null,"R07",{"$f":"IF(ISTEXT(VLOOKUP(B400,'FICHA DE PROJETO'!$A$399:$I$579,2,FALSE)),VLOOKUP(B400,'FICHA DE PROJETO'!$A$399:$I$579,2,FALSE),\"\")","v":""},null,null,null,null,null,null,null,null,"--"]
[null,"R08",{"$f":"IF(ISTEXT(VLOOKUP(B401,'FICHA DE PROJETO'!$A$399:$I$579,2,FALSE)),VLOOKUP(B401,'FICHA DE PROJETO'!$A$399:$I$579,2,FALSE),\"\")","v":""},null,null,null,null,null,null,null,null,"--"]
[null,"R09",{"$f":"IF(ISTEXT(VLOOKUP(B402,'FICHA DE PROJETO'!$A$399:$I$579,2,FALSE)),VLOOKUP(B402,'FICHA DE PROJETO'!$A$399:$I$579,2,FALSE),\"\")","v":""},null,null,null,null,null,null,null,null,"--"]
[null,"R10",{"$f":"IF(ISTEXT(VLOOKUP(B403,'FICHA DE PROJETO'!$A$399:$I$579,2,FALSE)),VLOOKUP(B403,'FICHA DE PROJETO'!$A$399:$I$579,2,FALSE),\"\")","v":""},null,null,null,null,null,null,null,null,"--"]
[null,"R11",{"$f":"IF(ISTEXT(VLOOKUP(B404,'FICHA DE PROJETO'!$A$399:$I$579,2,FALSE)),VLOOKUP(B404,'FICHA DE PROJETO'!$A$399:$I$579,2,FALSE),\"\")","v":""},null,null,null,null,null,null,null,null,"--"]
[null,"R12",{"$f":"IF(ISTEXT(VLOOKUP(B405,'FICHA DE PROJETO'!$A$399:$I$579,2,FALSE)),VLOOKUP(B405,'FICHA DE PROJETO'!$A$399:$I$579,2,FALSE),\"\")","v":""},null,null,null,null,null,null,null,null,"--"]
[null,"R13",{"$f":"IF(ISTEXT(VLOOKUP(B406,'FICHA DE PROJETO'!$A$399:$I$579,2,FALSE)),VLOOKUP(B406,'FICHA DE PROJETO'!$A$399:$I$579,2,FALSE),\"\")","v":""},null,null,null,null,null,null,null,null,"--"]
[null,"R14",{"$f":"IF(ISTEXT(VLOOKUP(B407,'FICHA DE PROJETO'!$A$399:$I$579,2,FALSE)),VLOOKUP(B407,'FICHA DE PROJETO'!$A$399:$I$579,2,FALSE),\"\")","v":""},null,null,null,null,null,null,null,null,"--"]
[null,"R15",{"$f":"IF(ISTEXT(VLOOKUP(B408,'FICHA DE PROJETO'!$A$399:$I$579,2,FALSE)),VLOOKUP(B408,'FICHA DE PROJETO'!$A$399:$I$579,2,FALSE),\"\")","v":""},null,null,null,null,null,null,null,null,"--"]
[null,"R16",{"$f":"IF(ISTEXT(VLOOKUP(B409,'FICHA DE PROJETO'!$A$399:$I$579,2,FALSE)),VLOOKUP(B409,'FICHA DE PROJETO'!$A$399:$I$579,2,FALSE),\"\")","v":""},null,null,null,null,null,null,null,null,"--"]
[null,"R17",{"$f":"IF(ISTEXT(VLOOKUP(B410,'FICHA DE PROJETO'!$A$399:$I$579,2,FALSE)),VLOOKUP(B410,'FICHA DE PROJETO'!$A$399:$I$579,2,FALSE),\"\")","v":""},null,null,null,null,null,null,null,null,"--"]
[null,"R18",{"$f":"IF(ISTEXT(VLOOKUP(B411,'FICHA DE PROJETO'!$A$399:$I$579,2,FALSE)),VLOOKUP(B411,'FICHA DE PROJETO'!$A$399:$I$579,2,FALSE),\"\")","v":""},null,null,null,null,null,null,null,null,"--"]
[null,"R19",{"$f":"IF(ISTEXT(VLOOKUP(B412,'FICHA DE PROJETO'!$A$399:$I$579,2,FALSE)),VLOOKUP(B412,'FICHA DE PROJETO'!$A$399:$I$579,2,FALSE),\"\")","v":""},null,null,null,null,null,null,null,null,"--"]
[null,"R20",{"$f":"IF(ISTEXT(VLOOKUP(B413,'FICHA DE PROJETO'!$A$399:$I$579,2,FALSE)),VLOOKUP(B413,'FICHA DE PROJETO'!$A$399:$I$579,2,FALSE),\"\")","v":""},null,null,null,null,null,null,null,null,"--"]
[null,"R21",{"$f":"IF(ISTEXT(VLOOKUP(B414,'FICHA DE PROJETO'!$A$399:$I$579,2,FALSE)),VLOOKUP(B414,'FICHA DE PROJETO'!$A$399:$I$579,2,FALSE),\"\")","v":""},null,null,null,null,null,null,null,null,"--"]
[null,"R22",{"$f":"IF(ISTEXT(VLOOKUP(B415,'FICHA DE PROJETO'!$A$399:$I$579,2,FALSE)),VLOOKUP(B415,'FICHA DE PROJETO'!$A$399:$I$579,2,FALSE),\"\")","v":""},null,null,null,null,null,null,null,null,"--"]
[null,"R23",{"$f":"IF(ISTEXT(VLOOKUP(B416,'FICHA DE PROJETO'!$A$399:$I$579,2,FALSE)),VLOOKUP(B416,'FICHA DE PROJETO'!$A$399:$I$579,2,FALSE),\"\")","v":""},null,null,null,null,null,null,null,null,"--"]
[null,"R24",{"$f":"IF(ISTEXT(VLOOKUP(B417,'FICHA DE PROJETO'!$A$399:$I$579,2,FALSE)),VLOOKUP(B417,'FICHA DE PROJETO'!$A$399:$I$579,2,FALSE),\"\")","v":""},null,null,null,null,null,null,null,null,{"$f":"IF(C417=\"\",\"--\",\"X\")","v":"--"}]
[null,"R25",{"$f":"IF(ISTEXT(VLOOKUP(B418,'FICHA DE PROJETO'!$A$399:$I$579,2,FALSE)),VLOOKUP(B418,'FICHA DE PROJETO'!$A$399:$I$579,2,FALSE),\"\")","v":""},null,null,null,null,null,null,null,null,"--"]
[null,"R26",{"$f":"IF(ISTEXT(VLOOKUP(B419,'FICHA DE PROJETO'!$A$399:$I$579,2,FALSE)),VLOOKUP(B419,'FICHA DE PROJETO'!$A$399:$I$579,2,FALSE),\"\")","v":""},null,null,null,null,null,null,null,null,"--"]
[null,"R27",{"$f":"IF(ISTEXT(VLOOKUP(B420,'FICHA DE PROJETO'!$A$399:$I$579,2,FALSE)),VLOOKUP(B420,'FICHA DE PROJETO'!$A$399:$I$579,2,FALSE),\"\")","v":""},null,null,null,null,null,null,null,null,"--"]
[null,"R28",{"$f":"IF(ISTEXT(VLOOKUP(B421,'FICHA DE PROJETO'!$A$399:$I$579,2,FALSE)),VLOOKUP(B421,'FICHA DE PROJETO'!$A$399:$I$579,2,FALSE),\"\")","v":""},null,null,null,null,null,null,null,null,"--"]
[null,"R29",{"$f":"IF(ISTEXT(VLOOKUP(B422,'FICHA DE PROJETO'!$A$399:$I$579,2,FALSE)),VLOOKUP(B422,'FICHA DE PROJETO'!$A$399:$I$579,2,FALSE),\"\")","v":""},null,null,null,null,null,null,null,null,"--"]
[null,"R30",{"$f":"IF(ISTEXT(VLOOKUP(B423,'FICHA DE PROJETO'!$A$399:$I$579,2,FALSE)),VLOOKUP(B423,'FICHA DE PROJETO'!$A$399:$I$579,2,FALSE),\"\")","v":""},null,null,null,null,null,null,null,null,"--"]
[null,"R31",{"$f":"IF(ISTEXT(VLOOKUP(B424,'FICHA DE PROJETO'!$A$399:$I$579,2,FALSE)),VLOOKUP(B424,'FICHA DE PROJETO'!$A$399:$I$579,2,FALSE),\"\")","v":""},null,null,null,null,null,null,null,null,"--"]
[null,"R32",{"$f":"IF(ISTEXT(VLOOKUP(B425,'FICHA DE PROJETO'!$A$399:$I$579,2,FALSE)),VLOOKUP(B425,'FICHA DE PROJETO'!$A$399:$I$579,2,FALSE),\"\")","v":""},null,null,null,null,null,null,null,null,"--"]
[null,"R33",{"$f":"IF(ISTEXT(VLOOKUP(B426,'FICHA DE PROJETO'!$A$399:$I$579,2,FALSE)),VLOOKUP(B426,'FICHA DE PROJETO'!$A$399:$I$579,2,FALSE),\"\")","v":""},null,null,null,null,null,null,null,null,"--"]
[null,"R34",{"$f":"IF(ISTEXT(VLOOKUP(B427,'FICHA DE PROJETO'!$A$399:$I$579,2,FALSE)),VLOOKUP(B427,'FICHA DE PROJETO'!$A$399:$I$579,2,FALSE),\"\")","v":""},null,null,null,null,null,null,null,null,"--"]
[null,"R35",{"$f":"IF(ISTEXT(VLOOKUP(B428,'FICHA DE PROJETO'!$A$399:$I$579,2,FALSE)),VLOOKUP(B428,'FICHA DE PROJETO'!$A$399:$I$579,2,FALSE),\"\")","v":""},null,null,null,null,null,null,null,null,"--"]
[null,"R36",{"$f":"IF(ISTEXT(VLOOKUP(B429,'FICHA DE PROJETO'!$A$399:$I$579,2,FALSE)),VLOOKUP(B429,'FICHA DE PROJETO'!$A$399:$I$579,2,FALSE),\"\")","v":""},null,null,null,null,null,null,null,null,"--"]
[null,"R37",{"$f":"IF(ISTEXT(VLOOKUP(B430,'FICHA DE PROJETO'!$A$399:$I$579,2,FALSE)),VLOOKUP(B430,'FICHA DE PROJETO'!$A$399:$I$579,2,FALSE),\"\")","v":""},null,null,null,null,null,null,null,null,"--"]
[null,"R38",{"$f":"IF(ISTEXT(VLOOKUP(B431,'FICHA DE PROJETO'!$A$399:$I$579,2,FALSE)),VLOOKUP(B431,'FICHA DE PROJETO'!$A$399:$I$579,2,FALSE),\"\")","v":""},null,null,null,null,null,null,null,null,"--"]
[null,"R39",{"$f":"IF(ISTEXT(VLOOKUP(B432,'FICHA DE PROJETO'!$A$399:$I$579,2,FALSE)),VLOOKUP(B432,'FICHA DE PROJETO'!$A$399:$I$579,2,FALSE),\"\")","v":""},null,null,null,null,null,null,null,null,"--"]
[null,"R40",{"$f":"IF(ISTEXT(VLOOKUP(B433,'FICHA DE PROJETO'!$A$399:$I$579,2,FALSE)),VLOOKUP(B433,'FICHA DE PROJETO'!$A$399:$I$579,2,FALSE),\"\")","v":""},null,null,null,null,null,null,null,null,"--"]
[null,"R41",{"$f":"IF(ISTEXT(VLOOKUP(B434,'FICHA DE PROJETO'!$A$399:$I$579,2,FALSE)),VLOOKUP(B434,'FICHA DE PROJETO'!$A$399:$I$579,2,FALSE),\"\")","v":""},null,null,null,null,null,null,null,null,"--"]
[null,"R42",{"$f":"IF(ISTEXT(VLOOKUP(B435,'FICHA DE PROJETO'!$A$399:$I$579,2,FALSE)),VLOOKUP(B435,'FICHA DE PROJETO'!$A$399:$I$579,2,FALSE),\"\")","v":""},null,null,null,null,null,null,null,null,"--"]
[null,"R43",{"$f":"IF(ISTEXT(VLOOKUP(B436,'FICHA DE PROJETO'!$A$399:$I$579,2,FALSE)),VLOOKUP(B436,'FICHA DE PROJETO'!$A$399:$I$579,2,FALSE),\"\")","v":""},null,null,null,null,null,null,null,null,"--"]
[null,"R44",{"$f":"IF(ISTEXT(VLOOKUP(B437,'FICHA DE PROJETO'!$A$399:$I$579,2,FALSE)),VLOOKUP(B437,'FICHA DE PROJETO'!$A$399:$I$579,2,FALSE),\"\")","v":""},null,null,null,null,null,null,null,null,"--"]
[null,"R45",{"$f":"IF(ISTEXT(VLOOKUP(B438,'FICHA DE PROJETO'!$A$399:$I$579,2,FALSE)),VLOOKUP(B438,'FICHA DE PROJETO'!$A$399:$I$579,2,FALSE),\"\")","v":""},null,null,null,null,null,null,null,null,"--"]
[null,"R46",{"$f":"IF(ISTEXT(VLOOKUP(B439,'FICHA DE PROJETO'!$A$399:$I$579,2,FALSE)),VLOOKUP(B439,'FICHA DE PROJETO'!$A$399:$I$579,2,FALSE),\"\")","v":""},null,null,null,null,null,null,null,null,"--"]
[null,"R47",{"$f":"IF(ISTEXT(VLOOKUP(B440,'FICHA DE PROJETO'!$A$399:$I$579,2,FALSE)),VLOOKUP(B440,'FICHA DE PROJETO'!$A$399:$I$579,2,FALSE),\"\")","v":""},null,null,null,null,null,null,null,null,"--"]
[null,"R48",{"$f":"IF(ISTEXT(VLOOKUP(B441,'FICHA DE PROJETO'!$A$399:$I$579,2,FALSE)),VLOOKUP(B441,'FICHA DE PROJETO'!$A$399:$I$579,2,FALSE),\"\")","v":""},null,null,null,null,null,null,null,null,"--"]
[null,"R49",{"$f":"IF(ISTEXT(VLOOKUP(B442,'FICHA DE PROJETO'!$A$399:$I$579,2,FALSE)),VLOOKUP(B442,'FICHA DE PROJETO'!$A$399:$I$579,2,FALSE),\"\")","v":""},null,null,null,null,null,null,null,null,"--"]
[null,"R50",{"$f":"IF(ISTEXT(VLOOKUP(B443,'FICHA DE PROJETO'!$A$399:$I$579,2,FALSE)),VLOOKUP(B443,'FICHA DE PROJETO'!$A$399:$I$579,2,FALSE),\"\")","v":""},null,null,null,null,null,null,null,null,"--"]
[null,"R51",{"$f":"IF(ISTEXT(VLOOKUP(B444,'FICHA DE PROJETO'!$A$399:$I$579,2,FALSE)),VLOOKUP(B444,'FICHA DE PROJETO'!$A$399:$I$579,2,FALSE),\"\")","v":""},null,null,null,null,null,null,null,null,"--"]
[null,"R52",{"$f":"IF(ISTEXT(VLOOKUP(B445,'FICHA DE PROJETO'!$A$399:$I$579,2,FALSE)),VLOOKUP(B445,'FICHA DE PROJETO'!$A$399:$I$579,2,FALSE),\"\")","v":""},null,null,null,null,null,null,null,null,"--"]
[null,"R53",{"$f":"IF(ISTEXT(VLOOKUP(B446,'FICHA DE PROJETO'!$A$399:$I$579,2,FALSE)),VLOOKUP(B446,'FICHA DE PROJETO'!$A$399:$I$579,2,FALSE),\"\")","v":""},null,null,null,null,null,null,null,null,"--"]
[null,"R54",{"$f":"IF(ISTEXT(VLOOKUP(B447,'FICHA DE PROJETO'!$A$399:$I$579,2,FALSE)),VLOOKUP(B447,'FICHA DE PROJETO'!$A$399:$I$579,2,FALSE),\"\")","v":""},null,null,null,null,null,null,null,null,"--"]
[null,"R55",{"$f":"IF(ISTEXT(VLOOKUP(B448,'FICHA DE PROJETO'!$A$399:$I$579,2,FALSE)),VLOOKUP(B448,'FICHA DE PROJETO'!$A$399:$I$579,2,FALSE),\"\")","v":""},null,null,null,null,null,null,null,null,"--"]
[null,"R56",{"$f":"IF(ISTEXT(VLOOKUP(B449,'FICHA DE PROJETO'!$A$399:$I$579,2,FALSE)),VLOOKUP(B449,'FICHA DE PROJETO'!$A$399:$I$579,2,FALSE),\"\")","v":""},null,null,null,null,null,null,null,null,"--"]
[null,"R57",{"$f":"IF(ISTEXT(VLOOKUP(B450,'FICHA DE PROJETO'!$A$399:$I$579,2,FALSE)),VLOOKUP(B450,'FICHA DE PROJETO'!$A$399:$I$579,2,FALSE),\"\")","v":""},null,null,null,null,null,null,null,null,"--"]
[null,"R58",{"$f":"IF(ISTEXT(VLOOKUP(B451,'FICHA DE PROJETO'!$A$399:$I$579,2,FALSE)),VLOOKUP(B451,'FICHA DE PROJETO'!$A$399:$I$579,2,FALSE),\"\")","v":""},null,null,null,null,null,null,null,null,"--"]
[null,"R59",{"$f":"IF(ISTEXT(VLOOKUP(B452,'FICHA DE PROJETO'!$A$399:$I$579,2,FALSE)),VLOOKUP(B452,'FICHA DE PROJETO'!$A$399:$I$579,2,FALSE),\"\")","v":""},null,null,null,null,null,null,null,null,"--"]
[null,"R60",{"$f":"IF(ISTEXT(VLOOKUP(B453,'FICHA DE PROJETO'!$A$399:$I$579,2,FALSE)),VLOOKUP(B453,'FICHA DE PROJETO'!$A$399:$I$579,2,FALSE),\"\")","v":""},null,null,null,null,null,null,null,null,"--"]
[null,"R61",{"$f":"IF(ISTEXT(VLOOKUP(B454,'FICHA DE PROJETO'!$A$399:$I$579,2,FALSE)),VLOOKUP(B454,'FICHA DE PROJETO'!$A$399:$I$579,2,FALSE),\"\")","v":""},null,null,null,null,null,null,null,null,"--"]
[null,"R62",{"$f":"IF(ISTEXT(VLOOKUP(B455,'FICHA DE PROJETO'!$A$399:$I$579,2,FALSE)),VLOOKUP(B455,'FICHA DE PROJETO'!$A$399:$I$579,2,FALSE),\"\")","v":""},null,null,null,null,null,null,null,null,"--"]
[null,"R63",{"$f":"IF(ISTEXT(VLOOKUP(B456,'FICHA DE PROJETO'!$A$399:$I$579,2,FALSE)),VLOOKUP(B456,'FICHA DE PROJETO'!$A$399:$I$579,2,FALSE),\"\")","v":""},null,null,null,null,null,null,null,null,"--"]
[null,"R64",{"$f":"IF(ISTEXT(VLOOKUP(B457,'FICHA DE PROJETO'!$A$399:$I$579,2,FALSE)),VLOOKUP(B457,'FICHA DE PROJETO'!$A$399:$I$579,2,FALSE),\"\")","v":""},null,null,null,null,null,null,null,null,"--"]
[null,"R65",{"$f":"IF(ISTEXT(VLOOKUP(B458,'FICHA DE PROJETO'!$A$399:$I$579,2,FALSE)),VLOOKUP(B458,'FICHA DE PROJETO'!$A$399:$I$579,2,FALSE),\"\")","v":""},null,null,null,null,null,null,null,null,"--"]
[null,"R66",{"$f":"IF(ISTEXT(VLOOKUP(B459,'FICHA DE PROJETO'!$A$399:$I$579,2,FALSE)),VLOOKUP(B459,'FICHA DE PROJETO'!$A$399:$I$579,2,FALSE),\"\")","v":""},null,null,null,null,null,null,null,null,"--"]
[null,"R67",{"$f":"IF(ISTEXT(VLOOKUP(B460,'FICHA DE PROJETO'!$A$399:$I$579,2,FALSE)),VLOOKUP(B460,'FICHA DE PROJETO'!$A$399:$I$579,2,FALSE),\"\")","v":""},null,null,null,null,null,null,null,null,"--"]
[null,"R68",{"$f":"IF(ISTEXT(VLOOKUP(B461,'FICHA DE PROJETO'!$A$399:$I$579,2,FALSE)),VLOOKUP(B461,'FICHA DE PROJETO'!$A$399:$I$579,2,FALSE),\"\")","v":""},null,null,null,null,null,null,null,null,"--"]
[null,"R69",{"$f":"IF(ISTEXT(VLOOKUP(B462,'FICHA DE PROJETO'!$A$399:$I$579,2,FALSE)),VLOOKUP(B462,'FICHA DE PROJETO'!$A$399:$I$579,2,FALSE),\"\")","v":""},null,null,null,null,null,null,null,null,"--"]
[null,"R70",{"$f":"IF(ISTEXT(VLOOKUP(B463,'FICHA DE PROJETO'!$A$399:$I$579,2,FALSE)),VLOOKUP(B463,'FICHA DE PROJETO'!$A$399:$I$579,2,FALSE),\"\")","v":""},null,null,null,null,null,null,null,null,"--"]
[null,"R71",{"$f":"IF(ISTEXT(VLOOKUP(B464,'FICHA DE PROJETO'!$A$399:$I$579,2,FALSE)),VLOOKUP(B464,'FICHA DE PROJETO'!$A$399:$I$579,2,FALSE),\"\")","v":""},null,null,null,null,null,null,null,null,"--"]
[null,"R72",{"$f":"IF(ISTEXT(VLOOKUP(B465,'FICHA DE PROJETO'!$A$399:$I$579,2,FALSE)),VLOOKUP(B465,'FICHA DE PROJETO'!$A$399:$I$579,2,FALSE),\"\")","v":""},null,null,null,null,null,null,null,null,"--"]
[null,"R73",{"$f":"IF(ISTEXT(VLOOKUP(B466,'FICHA DE PROJETO'!$A$399:$I$579,2,FALSE)),VLOOKUP(B466,'FICHA DE PROJETO'!$A$399:$I$579,2,FALSE),\"\")","v":""},null,null,null,null,null,null,null,null,"--"]
[null,"R74",{"$f":"IF(ISTEXT(VLOOKUP(B467,'FICHA DE PROJETO'!$A$399:$I$579,2,FALSE)),VLOOKUP(B467,'FICHA DE PROJETO'!$A$399:$I$579,2,FALSE),\"\")","v":""},null,null,null,null,null,null,null,null,"--"]
[null,"R75",{"$f":"IF(ISTEXT(VLOOKUP(B468,'FICHA DE PROJETO'!$A$399:$I$579,2,FALSE)),VLOOKUP(B468,'FICHA DE PROJETO'!$A$399:$I$579,2,FALSE),\"\")","v":""},null,null,null,null,null,null,null,null,"--"]
[null,"R76",{"$f":"IF(ISTEXT(VLOOKUP(B469,'FICHA DE PROJETO'!$A$399:$I$579,2,FALSE)),VLOOKUP(B469,'FICHA DE PROJETO'!$A$399:$I$579,2,FALSE),\"\")","v":""},null,null,null,null,null,null,null,null,"--"]
[null,"R77",{"$f":"IF(ISTEXT(VLOOKUP(B470,'FICHA DE PROJETO'!$A$399:$I$579,2,FALSE)),VLOOKUP(B470,'FICHA DE PROJETO'!$A$399:$I$579,2,FALSE),\"\")","v":""},null,null,null,null,null,null,null,null,"--"]
[null,"R78",{"$f":"IF(ISTEXT(VLOOKUP(B471,'FICHA DE PROJETO'!$A$399:$I$579,2,FALSE)),VLOOKUP(B471,'FICHA DE PROJETO'!$A$399:$I$579,2,FALSE),\"\")","v":""},null,null,null,null,null,null,null,null,"--"]
[null,"R79",{"$f":"IF(ISTEXT(VLOOKUP(B472,'FICHA DE PROJETO'!$A$399:$I$579,2,FALSE)),VLOOKUP(B472,'FICHA DE PROJETO'!$A$399:$I$579,2,FALSE),\"\")","v":""},null,null,null,null,null,null,null,null,"--"]
[null,"R80",{"$f":"IF(ISTEXT(VLOOKUP(B473,'FICHA DE PROJETO'!$A$399:$I$579,2,FALSE)),VLOOKUP(B473,'FICHA DE PROJETO'!$A$399:$I$579,2,FALSE),\"\")","v":""},null,null,null,null,null,null,null,null,"--"]
[null,"R81",{"$f":"IF(ISTEXT(VLOOKUP(B474,'FICHA DE PROJETO'!$A$399:$I$579,2,FALSE)),VLOOKUP(B474,'FICHA DE PROJETO'!$A$399:$I$579,2,FALSE),\"\")","v":""},null,null,null,null,null,null,null,null,"--"]
[null,"R82",{"$f":"IF(ISTEXT(VLOOKUP(B475,'FICHA DE PROJETO'!$A$399:$I$579,2,FALSE)),VLOOKUP(B475,'FICHA DE PROJETO'!$A$399:$I$579,2,FALSE),\"\")","v":""},null,null,null,null,null,null,null,null,"--"]
[null,"R83",{"$f":"IF(ISTEXT(VLOOKUP(B476,'FICHA DE PROJETO'!$A$399:$I$579,2,FALSE)),VLOOKUP(B476,'FICHA DE PROJETO'!$A$399:$I$579,2,FALSE),\"\")","v":""},null,null,null,null,null,null,null,null,"--"]
[null,"R84",{"$f":"IF(ISTEXT(VLOOKUP(B477,'FICHA DE PROJETO'!$A$399:$I$579,2,FALSE)),VLOOKUP(B477,'FICHA DE PROJETO'!$A$399:$I$579,2,FALSE),\"\")","v":""},null,null,null,null,null,null,null,null,"--"]
[null,"R85",{"$f":"IF(ISTEXT(VLOOKUP(B478,'FICHA DE PROJETO'!$A$399:$I$579,2,FALSE)),VLOOKUP(B478,'FICHA DE PROJETO'!$A$399:$I$579,2,FALSE),\"\")","v":""},null,null,null,null,null,null,null,null,"--"]
[null,"R86",{"$f":"IF(ISTEXT(VLOOKUP(B479,'FICHA DE PROJETO'!$A$399:$I$579,2,FALSE)),VLOOKUP(B479,'FICHA DE PROJETO'!$A$399:$I$579,2,FALSE),\"\")","v":""},null,null,null,null,null,null,null,null,"--"]
[null,"R87",{"$f":"IF(ISTEXT(VLOOKUP(B480,'FICHA DE PROJETO'!$A$399:$I$579,2,FALSE)),VLOOKUP(B480,'FICHA DE PROJETO'!$A$399:$I$579,2,FALSE),\"\")","v":""},null,null,null,null,null,null,null,null,"--"]
[null,"R88",{"$f":"IF(ISTEXT(VLOOKUP(B481,'FICHA DE PROJETO'!$A$399:$I$579,2,FALSE)),VLOOKUP(B481,'FICHA DE PROJETO'!$A$399:$I$579,2,FALSE),\"\")","v":""},null,null,null,null,null,null,null,null,{"$f":"IF(C481=\"\",\"--\",\"X\")","v":"--"}]
[null,"R89",{"$f":"IF(ISTEXT(VLOOKUP(B482,'FICHA DE PROJETO'!$A$399:$I$579,2,FALSE)),VLOOKUP(B482,'FICHA DE PROJETO'!$A$399:$I$579,2,FALSE),\"\")","v":""},null,null,null,null,null,null,null,null,"--"]
[null,"R90",{"$f":"IF(ISTEXT(VLOOKUP(B483,'FICHA DE PROJETO'!$A$399:$I$579,2,FALSE)),VLOOKUP(B483,'FICHA DE PROJETO'!$A$399:$I$579,2,FALSE),\"\")","v":""},null,null,null,null,null,null,null,null,"--"]
[null,"R91",{"$f":"IF(ISTEXT(VLOOKUP(B484,'FICHA DE PROJETO'!$A$399:$I$579,2,FALSE)),VLOOKUP(B484,'FICHA DE PROJETO'!$A$399:$I$579,2,FALSE),\"\")","v":""},null,null,null,null,null,null,null,null,"--"]
[null,"R92",{"$f":"IF(ISTEXT(VLOOKUP(B485,'FICHA DE PROJETO'!$A$399:$I$579,2,FALSE)),VLOOKUP(B485,'FICHA DE PROJETO'!$A$399:$I$579,2,FALSE),\"\")","v":""},null,null,null,null,null,null,null,null,"--"]
[null,"R93",{"$f":"IF(ISTEXT(VLOOKUP(B486,'FICHA DE PROJETO'!$A$399:$I$579,2,FALSE)),VLOOKUP(B486,'FICHA DE PROJETO'!$A$399:$I$579,2,FALSE),\"\")","v":""},null,null,null,null,null,null,null,null,"--"]
[null,"R94",{"$f":"IF(ISTEXT(VLOOKUP(B487,'FICHA DE PROJETO'!$A$399:$I$579,2,FALSE)),VLOOKUP(B487,'FICHA DE PROJETO'!$A$399:$I$579,2,FALSE),\"\")","v":""},null,null,null,null,null,null,null,null,"--"]
[null,"R95",{"$f":"IF(ISTEXT(VLOOKUP(B488,'FICHA DE PROJETO'!$A$399:$I$579,2,FALSE)),VLOOKUP(B488,'FICHA DE PROJETO'!$A$399:$I$579,2,FALSE),\"\")","v":""},null,null,null,null,null,null,null,null,"--"]
[null,"R96",{"$f":"IF(ISTEXT(VLOOKUP(B489,'FICHA DE PROJETO'!$A$399:$I$579,2,FALSE)),VLOOKUP(B489,'FICHA DE PROJETO'!$A$399:$I$579,2,FALSE),\"\")","v":""},null,null,null,null,null,null,null,null,"--"]
[null,"R97",{"$f":"IF(ISTEXT(VLOOKUP(B490,'FICHA DE PROJETO'!$A$399:$I$579,2,FALSE)),VLOOKUP(B490,'FICHA DE PROJETO'!$A$399:$I$579,2,FALSE),\"\")","v":""},null,null,null,null,null,null,null,null,"--"]
[null,"R98",{"$f":"IF(ISTEXT(VLOOKUP(B491,'FICHA DE PROJETO'!$A$399:$I$579,2,FALSE)),VLOOKUP(B491,'FICHA DE PROJETO'!$A$399:$I$579,2,FALSE),\"\")","v":""},null,null,null,null,null,null,null,null,"--"]
[null,"R99",{"$f":"IF(ISTEXT(VLOOKUP(B492,'FICHA DE PROJETO'!$A$399:$I$579,2,FALSE)),VLOOKUP(B492,'FICHA DE PROJETO'!$A$399:$I$579,2,FALSE),\"\")","v":""},null,null,null,null,null,null,null,null,"--"]
[null,"R100",{"$f":"IF(ISTEXT(VLOOKUP(B493,'FICHA DE PROJETO'!$A$399:$I$579,2,FALSE)),VLOOKUP(B493,'FICHA DE PROJETO'!$A$399:$I$579,2,FALSE),\"\")","v":""},null,null,null,null,null,null,null,null,"--"]
[null,"R101",{"$f":"IF(ISTEXT(VLOOKUP(B494,'FICHA DE PROJETO'!$A$399:$I$579,2,FALSE)),VLOOKUP(B494,'FICHA DE PROJETO'!$A$399:$I$579,2,FALSE),\"\")","v":""},null,null,null,null,null,null,null,null,"--"]
[null,"R102",{"$f":"IF(ISTEXT(VLOOKUP(B495,'FICHA DE PROJETO'!$A$399:$I$579,2,FALSE)),VLOOKUP(B495,'FICHA DE PROJETO'!$A$399:$I$579,2,FALSE),\"\")","v":""},null,null,null,null,null,null,null,null,"--"]
[null,"R103",{"$f":"IF(ISTEXT(VLOOKUP(B496,'FICHA DE PROJETO'!$A$399:$I$579,2,FALSE)),VLOOKUP(B496,'FICHA DE PROJETO'!$A$399:$I$579,2,FALSE),\"\")","v":""},null,null,null,null,null,null,null,null,"--"]
[null,"R104",{"$f":"IF(ISTEXT(VLOOKUP(B497,'FICHA DE PROJETO'!$A$399:$I$579,2,FALSE)),VLOOKUP(B497,'FICHA DE PROJETO'!$A$399:$I$579,2,FALSE),\"\")","v":""},null,null,null,null,null,null,null,null,"--"]
[null,"R105",{"$f":"IF(ISTEXT(VLOOKUP(B498,'FICHA DE PROJETO'!$A$399:$I$579,2,FALSE)),VLOOKUP(B498,'FICHA DE PROJETO'!$A$399:$I$579,2,FALSE),\"\")","v":""},null,null,null,null,null,null,null,null,"--"]
[null,"R106",{"$f":"IF(ISTEXT(VLOOKUP(B499,'FICHA DE PROJETO'!$A$399:$I$579,2,FALSE)),VLOOKUP(B499,'FICHA DE PROJETO'!$A$399:$I$579,2,FALSE),\"\")","v":""},null,null,null,null,null,null,null,null,"--"]
[null,"R107",{"$f":"IF(ISTEXT(VLOOKUP(B500,'FICHA DE PROJETO'!$A$399:$I$579,2,FALSE)),VLOOKUP(B500,'FICHA DE PROJETO'!$A$399:$I$579,2,FALSE),\"\")","v":""},null,null,null,null,null,null,null,null,"--"]
[null,"R108",{"$f":"IF(ISTEXT(VLOOKUP(B501,'FICHA DE PROJETO'!$A$399:$I$579,2,FALSE)),VLOOKUP(B501,'FICHA DE PROJETO'!$A$399:$I$579,2,FALSE),\"\")","v":""},null,null,null,null,null,null,null,null,"--"]
[null,"R109",{"$f":"IF(ISTEXT(VLOOKUP(B502,'FICHA DE PROJETO'!$A$399:$I$579,2,FALSE)),VLOOKUP(B502,'FICHA DE PROJETO'!$A$399:$I$579,2,FALSE),\"\")","v":""},null,null,null,null,null,null,null,null,"--"]
[null,"R110",{"$f":"IF(ISTEXT(VLOOKUP(B503,'FICHA DE PROJETO'!$A$399:$I$579,2,FALSE)),VLOOKUP(B503,'FICHA DE PROJETO'!$A$399:$I$579,2,FALSE),\"\")","v":""},null,null,null,null,null,null,null,null,"--"]
[null,"R111",{"$f":"IF(ISTEXT(VLOOKUP(B504,'FICHA DE PROJETO'!$A$399:$I$579,2,FALSE)),VLOOKUP(B504,'FICHA DE PROJETO'!$A$399:$I$579,2,FALSE),\"\")","v":""},null,null,null,null,null,null,null,null,"--"]
[null,"R112",{"$f":"IF(ISTEXT(VLOOKUP(B505,'FICHA DE PROJETO'!$A$399:$I$579,2,FALSE)),VLOOKUP(B505,'FICHA DE PROJETO'!$A$399:$I$579,2,FALSE),\"\")","v":""},null,null,null,null,null,null,null,null,"--"]
[null,"R113",{"$f":"IF(ISTEXT(VLOOKUP(B506,'FICHA DE PROJETO'!$A$399:$I$579,2,FALSE)),VLOOKUP(B506,'FICHA DE PROJETO'!$A$399:$I$579,2,FALSE),\"\")","v":""},null,null,null,null,null,null,null,null,"--"]
[null,"R114",{"$f":"IF(ISTEXT(VLOOKUP(B507,'FICHA DE PROJETO'!$A$399:$I$579,2,FALSE)),VLOOKUP(B507,'FICHA DE PROJETO'!$A$399:$I$579,2,FALSE),\"\")","v":""},null,null,null,null,null,null,null,null,"--"]
[null,"R115",{"$f":"IF(ISTEXT(VLOOKUP(B508,'FICHA DE PROJETO'!$A$399:$I$579,2,FALSE)),VLOOKUP(B508,'FICHA DE PROJETO'!$A$399:$I$579,2,FALSE),\"\")","v":""},null,null,null,null,null,null,null,null,"--"]
[null,"R116",{"$f":"IF(ISTEXT(VLOOKUP(B509,'FICHA DE PROJETO'!$A$399:$I$579,2,FALSE)),VLOOKUP(B509,'FICHA DE PROJETO'!$A$399:$I$579,2,FALSE),\"\")","v":""},null,null,null,null,null,null,null,null,"--"]
[null,"R117",{"$f":"IF(ISTEXT(VLOOKUP(B510,'FICHA DE PROJETO'!$A$399:$I$579,2,FALSE)),VLOOKUP(B510,'FICHA DE PROJETO'!$A$399:$I$579,2,FALSE),\"\")","v":""},null,null,null,null,null,null,null,null,"--"]
[null,"R118",{"$f":"IF(ISTEXT(VLOOKUP(B511,'FICHA DE PROJETO'!$A$399:$I$579,2,FALSE)),VLOOKUP(B511,'FICHA DE PROJETO'!$A$399:$I$579,2,FALSE),\"\")","v":""},null,null,null,null,null,null,null,null,"--"]
[null,"R119",{"$f":"IF(ISTEXT(VLOOKUP(B512,'FICHA DE PROJETO'!$A$399:$I$579,2,FALSE)),VLOOKUP(B512,'FICHA DE PROJETO'!$A$399:$I$579,2,FALSE),\"\")","v":""},null,null,null,null,null,null,null,null,"--"]
[null,"R120",{"$f":"IF(ISTEXT(VLOOKUP(B513,'FICHA DE PROJETO'!$A$399:$I$579,2,FALSE)),VLOOKUP(B513,'FICHA DE PROJETO'!$A$399:$I$579,2,FALSE),\"\")","v":""},null,null,null,null,null,null,null,null,"--"]
[null,"R121",{"$f":"IF(ISTEXT(VLOOKUP(B514,'FICHA DE PROJETO'!$A$399:$I$579,2,FALSE)),VLOOKUP(B514,'FICHA DE PROJETO'!$A$399:$I$579,2,FALSE),\"\")","v":""},null,null,null,null,null,null,null,null,"--"]
[null,"R122",{"$f":"IF(ISTEXT(VLOOKUP(B515,'FICHA DE PROJETO'!$A$399:$I$579,2,FALSE)),VLOOKUP(B515,'FICHA DE PROJETO'!$A$399:$I$579,2,FALSE),\"\")","v":""},null,null,null,null,null,null,null,null,"--"]
[null,"R123",{"$f":"IF(ISTEXT(VLOOKUP(B516,'FICHA DE PROJETO'!$A$399:$I$579,2,FALSE)),VLOOKUP(B516,'FICHA DE PROJETO'!$A$399:$I$579,2,FALSE),\"\")","v":""},null,null,null,null,null,null,null,null,"--"]
[null,"R124",{"$f":"IF(ISTEXT(VLOOKUP(B517,'FICHA DE PROJETO'!$A$399:$I$579,2,FALSE)),VLOOKUP(B517,'FICHA DE PROJETO'!$A$399:$I$579,2,FALSE),\"\")","v":""},null,null,null,null,null,null,null,null,"--"]
[null,"R125",{"$f":"IF(ISTEXT(VLOOKUP(B518,'FICHA DE PROJETO'!$A$399:$I$579,2,FALSE)),VLOOKUP(B518,'FICHA DE PROJETO'!$A$399:$I$579,2,FALSE),\"\")","v":""},null,null,null,null,null,null,null,null,"--"]
[null,"R126",{"$f":"IF(ISTEXT(VLOOKUP(B519,'FICHA DE PROJETO'!$A$399:$I$579,2,FALSE)),VLOOKUP(B519,'FICHA DE PROJETO'!$A$399:$I$579,2,FALSE),\"\")","v":""},null,null,null,null,null,null,null,null,"--"]
[null,"R127",{"$f":"IF(ISTEXT(VLOOKUP(B520,'FICHA DE PROJETO'!$A$399:$I$579,2,FALSE)),VLOOKUP(B520,'FICHA DE PROJETO'!$A$399:$I$579,2,FALSE),\"\")","v":""},null,null,null,null,null,null,null,null,"--"]
[null,"R128",{"$f":"IF(ISTEXT(VLOOKUP(B521,'FICHA DE PROJETO'!$A$399:$I$579,2,FALSE)),VLOOKUP(B521,'FICHA DE PROJETO'!$A$399:$I$579,2,FALSE),\"\")","v":""},null,null,null,null,null,null,null,null,"--"]
[null,"R129",{"$f":"IF(ISTEXT(VLOOKUP(B522,'FICHA DE PROJETO'!$A$399:$I$579,2,FALSE)),VLOOKUP(B522,'FICHA DE PROJETO'!$A$399:$I$579,2,FALSE),\"\")","v":""},null,null,null,null,null,null,null,null,"--"]
[null,"R130",{"$f":"IF(ISTEXT(VLOOKUP(B523,'FICHA DE PROJETO'!$A$399:$I$579,2,FALSE)),VLOOKUP(B523,'FICHA DE PROJETO'!$A$399:$I$579,2,FALSE),\"\")","v":""},null,null,null,null,null,null,null,null,"--"]
[null,"R131",{"$f":"IF(ISTEXT(VLOOKUP(B524,'FICHA DE PROJETO'!$A$399:$I$579,2,FALSE)),VLOOKUP(B524,'FICHA DE PROJETO'!$A$399:$I$579,2,FALSE),\"\")","v":""},null,null,null,null,null,null,null,null,"--"]
[null,"R132",{"$f":"IF(ISTEXT(VLOOKUP(B525,'FICHA DE PROJETO'!$A$399:$I$579,2,FALSE)),VLOOKUP(B525,'FICHA DE PROJETO'!$A$399:$I$579,2,FALSE),\"\")","v":""},null,null,null,null,null,null,null,null,"--"]
[null,"R133",{"$f":"IF(ISTEXT(VLOOKUP(B526,'FICHA DE PROJETO'!$A$399:$I$579,2,FALSE)),VLOOKUP(B526,'FICHA DE PROJETO'!$A$399:$I$579,2,FALSE),\"\")","v":""},null,null,null,null,null,null,null,null,"--"]
[null,"R134",{"$f":"IF(ISTEXT(VLOOKUP(B527,'FICHA DE PROJETO'!$A$399:$I$579,2,FALSE)),VLOOKUP(B527,'FICHA DE PROJETO'!$A$399:$I$579,2,FALSE),\"\")","v":""},null,null,null,null,null,null,null,null,"--"]
[null,"R135",{"$f":"IF(ISTEXT(VLOOKUP(B528,'FICHA DE PROJETO'!$A$399:$I$579,2,FALSE)),VLOOKUP(B528,'FICHA DE PROJETO'!$A$399:$I$579,2,FALSE),\"\")","v":""},null,null,null,null,null,null,null,null,"--"]
[null,"R136",{"$f":"IF(ISTEXT(VLOOKUP(B529,'FICHA DE PROJETO'!$A$399:$I$579,2,FALSE)),VLOOKUP(B529,'FICHA DE PROJETO'!$A$399:$I$579,2,FALSE),\"\")","v":""},null,null,null,null,null,null,null,null,"--"]
[null,"R137",{"$f":"IF(ISTEXT(VLOOKUP(B530,'FICHA DE PROJETO'!$A$399:$I$579,2,FALSE)),VLOOKUP(B530,'FICHA DE PROJETO'!$A$399:$I$579,2,FALSE),\"\")","v":""},null,null,null,null,null,null,null,null,"--"]
[null,"R138",{"$f":"IF(ISTEXT(VLOOKUP(B531,'FICHA DE PROJETO'!$A$399:$I$579,2,FALSE)),VLOOKUP(B531,'FICHA DE PROJETO'!$A$399:$I$579,2,FALSE),\"\")","v":""},null,null,null,null,null,null,null,null,"--"]
[null,"R139",{"$f":"IF(ISTEXT(VLOOKUP(B532,'FICHA DE PROJETO'!$A$399:$I$579,2,FALSE)),VLOOKUP(B532,'FICHA DE PROJETO'!$A$399:$I$579,2,FALSE),\"\")","v":""},null,null,null,null,null,null,null,null,"--"]
[null,"R140",{"$f":"IF(ISTEXT(VLOOKUP(B533,'FICHA DE PROJETO'!$A$399:$I$579,2,FALSE)),VLOOKUP(B533,'FICHA DE PROJETO'!$A$399:$I$579,2,FALSE),\"\")","v":""},null,null,null,null,null,null,null,null,"--"]
[null,"R141",{"$f":"IF(ISTEXT(VLOOKUP(B534,'FICHA DE PROJETO'!$A$399:$I$579,2,FALSE)),VLOOKUP(B534,'FICHA DE PROJETO'!$A$399:$I$579,2,FALSE),\"\")","v":""},null,null,null,null,null,null,null,null,"--"]
[null,"R142",{"$f":"IF(ISTEXT(VLOOKUP(B535,'FICHA DE PROJETO'!$A$399:$I$579,2,FALSE)),VLOOKUP(B535,'FICHA DE PROJETO'!$A$399:$I$579,2,FALSE),\"\")","v":""},null,null,null,null,null,null,null,null,"--"]
[null,"R143",{"$f":"IF(ISTEXT(VLOOKUP(B536,'FICHA DE PROJETO'!$A$399:$I$579,2,FALSE)),VLOOKUP(B536,'FICHA DE PROJETO'!$A$399:$I$579,2,FALSE),\"\")","v":""},null,null,null,null,null,null,null,null,"--"]
[null,"R144",{"$f":"IF(ISTEXT(VLOOKUP(B537,'FICHA DE PROJETO'!$A$399:$I$579,2,FALSE)),VLOOKUP(B537,'FICHA DE PROJETO'!$A$399:$I$579,2,FALSE),\"\")","v":""},null,null,null,null,null,null,null,null,"--"]
[null,"R145",{"$f":"IF(ISTEXT(VLOOKUP(B538,'FICHA DE PROJETO'!$A$399:$I$579,2,FALSE)),VLOOKUP(B538,'FICHA DE PROJETO'!$A$399:$I$579,2,FALSE),\"\")","v":""},null,null,null,null,null,null,null,null,"--"]
[null,"R146",{"$f":"IF(ISTEXT(VLOOKUP(B539,'FICHA DE PROJETO'!$A$399:$I$579,2,FALSE)),VLOOKUP(B539,'FICHA DE PROJETO'!$A$399:$I$579,2,FALSE),\"\")","v":""},null,null,null,null,null,null,null,null,"--"]
[null,"R147",{"$f":"IF(ISTEXT(VLOOKUP(B540,'FICHA DE PROJETO'!$A$399:$I$579,2,FALSE)),VLOOKUP(B540,'FICHA DE PROJETO'!$A$399:$I$579,2,FALSE),\"\")","v":""},null,null,null,null,null,null,null,null,"--"]
[null,"R148",{"$f":"IF(ISTEXT(VLOOKUP(B541,'FICHA DE PROJETO'!$A$399:$I$579,2,FALSE)),VLOOKUP(B541,'FICHA DE PROJETO'!$A$399:$I$579,2,FALSE),\"\")","v":""},null,null,null,null,null,null,null,null,"--"]
[null,"R149",{"$f":"IF(ISTEXT(VLOOKUP(B542,'FICHA DE PROJETO'!$A$399:$I$579,2,FALSE)),VLOOKUP(B542,'FICHA DE PROJETO'!$A$399:$I$579,2,FALSE),\"\")","v":""},null,null,null,null,null,null,null,null,"--"]
[null,"R150",{"$f":"IF(ISTEXT(VLOOKUP(B543,'FICHA DE PROJETO'!$A$399:$I$579,2,FALSE)),VLOOKUP(B543,'FICHA DE PROJETO'!$A$399:$I$579,2,FALSE),\"\")","v":""},null,null,null,null,null,null,null,null,"--"]
[null,"R151",{"$f":"IF(ISTEXT(VLOOKUP(B544,'FICHA DE PROJETO'!$A$399:$I$579,2,FALSE)),VLOOKUP(B544,'FICHA DE PROJETO'!$A$399:$I$579,2,FALSE),\"\")","v":""},null,null,null,null,null,null,null,null,"--"]
[null,"R152",{"$f":"IF(ISTEXT(VLOOKUP(B545,'FICHA DE PROJETO'!$A$399:$I$579,2,FALSE)),VLOOKUP(B545,'FICHA DE PROJETO'!$A$399:$I$579,2,FALSE),\"\")","v":""},null,null,null,null,null,null,null,null,{"$f":"IF(C545=\"\",\"--\",\"X\")","v":"--"}]
[null,"R153",{"$f":"IF(ISTEXT(VLOOKUP(B546,'FICHA DE PROJETO'!$A$399:$I$579,2,FALSE)),VLOOKUP(B546,'FICHA DE PROJETO'!$A$399:$I$579,2,FALSE),\"\")","v":""},null,null,null,null,null,null,null,null,"--"]
[null,"R154",{"$f":"IF(ISTEXT(VLOOKUP(B547,'FICHA DE PROJETO'!$A$399:$I$579,2,FALSE)),VLOOKUP(B547,'FICHA DE PROJETO'!$A$399:$I$579,2,FALSE),\"\")","v":""},null,null,null,null,null,null,null,null,"--"]
[null,"R155",{"$f":"IF(ISTEXT(VLOOKUP(B548,'FICHA DE PROJETO'!$A$399:$I$579,2,FALSE)),VLOOKUP(B548,'FICHA DE PROJETO'!$A$399:$I$579,2,FALSE),\"\")","v":""},null,null,null,null,null,null,null,null,"--"]
[null,"R156",{"$f":"IF(ISTEXT(VLOOKUP(B549,'FICHA DE PROJETO'!$A$399:$I$579,2,FALSE)),VLOOKUP(B549,'FICHA DE PROJETO'!$A$399:$I$579,2,FALSE),\"\")","v":""},null,null,null,null,null,null,null,null,"--"]
[null,"R157",{"$f":"IF(ISTEXT(VLOOKUP(B550,'FICHA DE PROJETO'!$A$399:$I$579,2,FALSE)),VLOOKUP(B550,'FICHA DE PROJETO'!$A$399:$I$579,2,FALSE),\"\")","v":""},null,null,null,null,null,null,null,null,"--"]
[null,"R158",{"$f":"IF(ISTEXT(VLOOKUP(B551,'FICHA DE PROJETO'!$A$399:$I$579,2,FALSE)),VLOOKUP(B551,'FICHA DE PROJETO'!$A$399:$I$579,2,FALSE),\"\")","v":""},null,null,null,null,null,null,null,null,"--"]
[null,"R159",{"$f":"IF(ISTEXT(VLOOKUP(B552,'FICHA DE PROJETO'!$A$399:$I$579,2,FALSE)),VLOOKUP(B552,'FICHA DE PROJETO'!$A$399:$I$579,2,FALSE),\"\")","v":""},null,null,null,null,null,null,null,null,"--"]
[null,"R160",{"$f":"IF(ISTEXT(VLOOKUP(B553,'FICHA DE PROJETO'!$A$399:$I$579,2,FALSE)),VLOOKUP(B553,'FICHA DE PROJETO'!$A$399:$I$579,2,FALSE),\"\")","v":""},null,null,null,null,null,null,null,null,"--"]
[null,"R161",{"$f":"IF(ISTEXT(VLOOKUP(B554,'FICHA DE PROJETO'!$A$399:$I$579,2,FALSE)),VLOOKUP(B554,'FICHA DE PROJETO'!$A$399:$I$579,2,FALSE),\"\")","v":""},null,null,null,null,null,null,null,null,"--"]
[null,"R162",{"$f":"IF(ISTEXT(VLOOKUP(B555,'FICHA DE PROJETO'!$A$399:$I$579,2,FALSE)),VLOOKUP(B555,'FICHA DE PROJETO'!$A$399:$I$579,2,FALSE),\"\")","v":""},null,null,null,null,null,null,null,null,"--"]
[null,"R163",{"$f":"IF(ISTEXT(VLOOKUP(B556,'FICHA DE PROJETO'!$A$399:$I$579,2,FALSE)),VLOOKUP(B556,'FICHA DE PROJETO'!$A$399:$I$579,2,FALSE),\"\")","v":""},null,null,null,null,null,null,null,null,"--"]
[null,"R164",{"$f":"IF(ISTEXT(VLOOKUP(B557,'FICHA DE PROJETO'!$A$399:$I$579,2,FALSE)),VLOOKUP(B557,'FICHA DE PROJETO'!$A$399:$I$579,2,FALSE),\"\")","v":""},null,null,null,null,null,null,null,null,"--"]
[null,"R165",{"$f":"IF(ISTEXT(VLOOKUP(B558,'FICHA DE PROJETO'!$A$399:$I$579,2,FALSE)),VLOOKUP(B558,'FICHA DE PROJETO'!$A$399:$I$579,2,FALSE),\"\")","v":""},null,null,null,null,null,null,null,null,"--"]
[null,"R166",{"$f":"IF(ISTEXT(VLOOKUP(B559,'FICHA DE PROJETO'!$A$399:$I$579,2,FALSE)),VLOOKUP(B559,'FICHA DE PROJETO'!$A$399:$I$579,2,FALSE),\"\")","v":""},null,null,null,null,null,null,null,null,"--"]
[null,"R167",{"$f":"IF(ISTEXT(VLOOKUP(B560,'FICHA DE PROJETO'!$A$399:$I$579,2,FALSE)),VLOOKUP(B560,'FICHA DE PROJETO'!$A$399:$I$579,2,FALSE),\"\")","v":""},null,null,null,null,null,null,null,null,"--"]
[null,"R168",{"$f":"IF(ISTEXT(VLOOKUP(B561,'FICHA DE PROJETO'!$A$399:$I$579,2,FALSE)),VLOOKUP(B561,'FICHA DE PROJETO'!$A$399:$I$579,2,FALSE),\"\")","v":""},null,null,null,null,null,null,null,null,"--"]
[null,"R169",{"$f":"IF(ISTEXT(VLOOKUP(B562,'FICHA DE PROJETO'!$A$399:$I$579,2,FALSE)),VLOOKUP(B562,'FICHA DE PROJETO'!$A$399:$I$579,2,FALSE),\"\")","v":""},null,null,null,null,null,null,null,null,"--"]
[null,"R170",{"$f":"IF(ISTEXT(VLOOKUP(B563,'FICHA DE PROJETO'!$A$399:$I$579,2,FALSE)),VLOOKUP(B563,'FICHA DE PROJETO'!$A$399:$I$579,2,FALSE),\"\")","v":""},null,null,null,null,null,null,null,null,"--"]
[null,"R171",{"$f":"IF(ISTEXT(VLOOKUP(B564,'FICHA DE PROJETO'!$A$399:$I$579,2,FALSE)),VLOOKUP(B564,'FICHA DE PROJETO'!$A$399:$I$579,2,FALSE),\"\")","v":""},null,null,null,null,null,null,null,null,"--"]
[null,"R172",{"$f":"IF(ISTEXT(VLOOKUP(B565,'FICHA DE PROJETO'!$A$399:$I$579,2,FALSE)),VLOOKUP(B565,'FICHA DE PROJETO'!$A$399:$I$579,2,FALSE),\"\")","v":""},null,null,null,null,null,null,null,null,"--"]
[null,"R173",{"$f":"IF(ISTEXT(VLOOKUP(B566,'FICHA DE PROJETO'!$A$399:$I$579,2,FALSE)),VLOOKUP(B566,'FICHA DE PROJETO'!$A$399:$I$579,2,FALSE),\"\")","v":""},null,null,null,null,null,null,null,null,"--"]
[null,"R174",{"$f":"IF(ISTEXT(VLOOKUP(B567,'FICHA DE PROJETO'!$A$399:$I$579,2,FALSE)),VLOOKUP(B567,'FICHA DE PROJETO'!$A$399:$I$579,2,FALSE),\"\")","v":""},null,null,null,null,null,null,null,null,"--"]
[null,"R175",{"$f":"IF(ISTEXT(VLOOKUP(B568,'FICHA DE PROJETO'!$A$399:$I$579,2,FALSE)),VLOOKUP(B568,'FICHA DE PROJETO'!$A$399:$I$579,2,FALSE),\"\")","v":""},null,null,null,null,null,null,null,null,"--"]
[null,"R176",{"$f":"IF(ISTEXT(VLOOKUP(B569,'FICHA DE PROJETO'!$A$399:$I$579,2,FALSE)),VLOOKUP(B569,'FICHA DE PROJETO'!$A$399:$I$579,2,FALSE),\"\")","v":""},null,null,null,null,null,null,null,null,"--"]
[null,"R177",{"$f":"IF(ISTEXT(VLOOKUP(B570,'FICHA DE PROJETO'!$A$399:$I$579,2,FALSE)),VLOOKUP(B570,'FICHA DE PROJETO'!$A$399:$I$579,2,FALSE),\"\")","v":""},null,null,null,null,null,null,null,null,"--"]
[null,"R178",{"$f":"IF(ISTEXT(VLOOKUP(B571,'FICHA DE PROJETO'!$A$399:$I$579,2,FALSE)),VLOOKUP(B571,'FICHA DE PROJETO'!$A$399:$I$579,2,FALSE),\"\")","v":""},null,null,null,null,null,null,null,null,"--"]
[null,"R179",{"$f":"IF(ISTEXT(VLOOKUP(B572,'FICHA DE PROJETO'!$A$399:$I$579,2,FALSE)),VLOOKUP(B572,'FICHA DE PROJETO'!$A$399:$I$579,2,FALSE),\"\")","v":""},null,null,null,null,null,null,null,null,"--"]
[null,"R180",{"$f":"IF(ISTEXT(VLOOKUP(B573,'FICHA DE PROJETO'!$A$399:$I$579,2,FALSE)),VLOOKUP(B573,'FICHA DE PROJETO'!$A$399:$I$579,2,FALSE),\"\")","v":""},null,null,null,null,null,null,null,null,"--"]
["        ",null,"    ",null,null,null,null,null,null,null,null,{"$f":"IF(('FICHA DE PROJETO'!$K$580=\"X\"),\"X\",\"---\")","v":"---"}]
[{"$f":"IF(('FICHA DE PROJETO'!K580=\"X\"),\"Lote 04\",\"---\")","v":"---"},null,null,null,null,null,null,null,null,null,null,{"$f":"IF(('FICHA DE PROJETO'!$K$580=\"X\"),\"X\",\"---\")","v":"---"}]
[null,"R01",{"$f":"IF(ISTEXT(VLOOKUP(B576,'FICHA DE PROJETO'!$A$581:$I$761,2,FALSE)),VLOOKUP(B576,'FICHA DE PROJETO'!$A$581:$I$761,2,FALSE),\"\")","v":""},null,null,null,null,null,null,null,null,"--"]
[null,"R02",{"$f":"IF(ISTEXT(VLOOKUP(B577,'FICHA DE PROJETO'!$A$581:$I$761,2,FALSE)),VLOOKUP(B577,'FICHA DE PROJETO'!$A$581:$I$761,2,FALSE),\"\")","v":""},null,null,null,null,null,null,null,null,"--"]
[null,"R03",{"$f":"IF(ISTEXT(VLOOKUP(B578,'FICHA DE PROJETO'!$A$581:$I$761,2,FALSE)),VLOOKUP(B578,'FICHA DE PROJETO'!$A$581:$I$761,2,FALSE),\"\")","v":""},null,null,null,null,null,null,null,null,"--"]
[null,"R04",{"$f":"IF(ISTEXT(VLOOKUP(B579,'FICHA DE PROJETO'!$A$581:$I$761,2,FALSE)),VLOOKUP(B579,'FICHA DE PROJETO'!$A$581:$I$761,2,FALSE),\"\")","v":""},null,null,null,null,null,null,null,null,"--"]
[null,"R05",{"$f":"IF(ISTEXT(VLOOKUP(B580,'FICHA DE PROJETO'!$A$581:$I$761,2,FALSE)),VLOOKUP(B580,'FICHA DE PROJETO'!$A$581:$I$761,2,FALSE),\"\")","v":""},null,null,null,null,null,null,null,null,"--"]
[null,"R06",{"$f":"IF(ISTEXT(VLOOKUP(B581,'FICHA DE PROJETO'!$A$581:$I$761,2,FALSE)),VLOOKUP(B581,'FICHA DE PROJETO'!$A$581:$I$761,2,FALSE),\"\")","v":""},null,null,null,null,null,null,null,null,"--"]
[null,"R07",{"$f":"IF(ISTEXT(VLOOKUP(B582,'FICHA DE PROJETO'!$A$581:$I$761,2,FALSE)),VLOOKUP(B582,'FICHA DE PROJETO'!$A$581:$I$761,2,FALSE),\"\")","v":""},null,null,null,null,null,null,null,null,"--"]
[null,"R08",{"$f":"IF(ISTEXT(VLOOKUP(B583,'FICHA DE PROJETO'!$A$581:$I$761,2,FALSE)),VLOOKUP(B583,'FICHA DE PROJETO'!$A$581:$I$761,2,FALSE),\"\")","v":""},null,null,null,null,null,null,null,null,"--"]
[null,"R09",{"$f":"IF(ISTEXT(VLOOKUP(B584,'FICHA DE PROJETO'!$A$581:$I$761,2,FALSE)),VLOOKUP(B584,'FICHA DE PROJETO'!$A$581:$I$761,2,FALSE),\"\")","v":""},null,null,null,null,null,null,null,null,"--"]
[null,"R10",{"$f":"IF(ISTEXT(VLOOKUP(B585,'FICHA DE PROJETO'!$A$581:$I$761,2,FALSE)),VLOOKUP(B585,'FICHA DE PROJETO'!$A$581:$I$761,2,FALSE),\"\")","v":""},null,null,null,null,null,null,null,null,"--"]
[null,"R11",{"$f":"IF(ISTEXT(VLOOKUP(B586,'FICHA DE PROJETO'!$A$581:$I$761,2,FALSE)),VLOOKUP(B586,'FICHA DE PROJETO'!$A$581:$I$761,2,FALSE),\"\")","v":""},null,null,null,null,null,null,null,null,"--"]
[null,"R12",{"$f":"IF(ISTEXT(VLOOKUP(B587,'FICHA DE PROJETO'!$A$581:$I$761,2,FALSE)),VLOOKUP(B587,'FICHA DE PROJETO'!$A$581:$I$761,2,FALSE),\"\")","v":""},null,null,null,null,null,null,null,null,"--"]
[null,"R13",{"$f":"IF(ISTEXT(VLOOKUP(B588,'FICHA DE PROJETO'!$A$581:$I$761,2,FALSE)),VLOOKUP(B588,'FICHA DE PROJETO'!$A$581:$I$761,2,FALSE),\"\")","v":""},null,null,null,null,null,null,null,null,"--"]
[null,"R14",{"$f":"IF(ISTEXT(VLOOKUP(B589,'FICHA DE PROJETO'!$A$581:$I$761,2,FALSE)),VLOOKUP(B589,'FICHA DE PROJETO'!$A$581:$I$761,2,FALSE),\"\")","v":""},null,null,null,null,null,null,null,null,"--"]
[null,"R15",{"$f":"IF(ISTEXT(VLOOKUP(B590,'FICHA DE PROJETO'!$A$581:$I$761,2,FALSE)),VLOOKUP(B590,'FICHA DE PROJETO'!$A$581:$I$761,2,FALSE),\"\")","v":""},null,null,null,null,null,null,null,null,"--"]
[null,"R16",{"$f":"IF(ISTEXT(VLOOKUP(B591,'FICHA DE PROJETO'!$A$581:$I$761,2,FALSE)),VLOOKUP(B591,'FICHA DE PROJETO'!$A$581:$I$761,2,FALSE),\"\")","v":""},null,null,null,null,null,null,null,null,"--"]
[null,"R17",{"$f":"IF(ISTEXT(VLOOKUP(B592,'FICHA DE PROJETO'!$A$581:$I$761,2,FALSE)),VLOOKUP(B592,'FICHA DE PROJETO'!$A$581:$I$761,2,FALSE),\"\")","v":""},null,null,null,null,null,null,null,null,"--"]
[null,"R18",{"$f":"IF(ISTEXT(VLOOKUP(B593,'FICHA DE PROJETO'!$A$581:$I$761,2,FALSE)),VLOOKUP(B593,'FICHA DE PROJETO'!$A$581:$I$761,2,FALSE),\"\")","v":""},null,null,null,null,null,null,null,null,"--"]
[null,"R19",{"$f":"IF(ISTEXT(VLOOKUP(B594,'FICHA DE PROJETO'!$A$581:$I$761,2,FALSE)),VLOOKUP(B594,'FICHA DE PROJETO'!$A$581:$I$761,2,FALSE),\"\")","v":""},null,null,null,null,null,null,null,null,"--"]
[null,"R20",{"$f":"IF(ISTEXT(VLOOKUP(B595,'FICHA DE PROJETO'!$A$581:$I$761,2,FALSE)),VLOOKUP(B595,'FICHA DE PROJETO'!$A$581:$I$761,2,FALSE),\"\")","v":""},null,null,null,null,null,null,null,null,"--"]
[null,"R21",{"$f":"IF(ISTEXT(VLOOKUP(B596,'FICHA DE PROJETO'!$A$581:$I$761,2,FALSE)),VLOOKUP(B596,'FICHA DE PROJETO'!$A$581:$I$761,2,FALSE),\"\")","v":""},null,null,null,null,null,null,null,null,"--"]
[null,"R22",{"$f":"IF(ISTEXT(VLOOKUP(B597,'FICHA DE PROJETO'!$A$581:$I$761,2,FALSE)),VLOOKUP(B597,'FICHA DE PROJETO'!$A$581:$I$761,2,FALSE),\"\")","v":""},null,null,null,null,null,null,null,null,"--"]
[null,"R23",{"$f":"IF(ISTEXT(VLOOKUP(B598,'FICHA DE PROJETO'!$A$581:$I$761,2,FALSE)),VLOOKUP(B598,'FICHA DE PROJETO'!$A$581:$I$761,2,FALSE),\"\")","v":""},null,null,null,null,null,null,null,null,"--"]
[null,"R24",{"$f":"IF(ISTEXT(VLOOKUP(B599,'FICHA DE PROJETO'!$A$581:$I$761,2,FALSE)),VLOOKUP(B599,'FICHA DE PROJETO'!$A$581:$I$761,2,FALSE),\"\")","v":""},null,null,null,null,null,null,null,null,"--"]
[null,"R25",{"$f":"IF(ISTEXT(VLOOKUP(B600,'FICHA DE PROJETO'!$A$581:$I$761,2,FALSE)),VLOOKUP(B600,'FICHA DE PROJETO'!$A$581:$I$761,2,FALSE),\"\")","v":""},null,null,null,null,null,null,null,null,"--"]
[null,"R26",{"$f":"IF(ISTEXT(VLOOKUP(B601,'FICHA DE PROJETO'!$A$581:$I$761,2,FALSE)),VLOOKUP(B601,'FICHA DE PROJETO'!$A$581:$I$761,2,FALSE),\"\")","v":""},null,null,null,null,null,null,null,null,"--"]
[null,"R27",{"$f":"IF(ISTEXT(VLOOKUP(B602,'FICHA DE PROJETO'!$A$581:$I$761,2,FALSE)),VLOOKUP(B602,'FICHA DE PROJETO'!$A$581:$I$761,2,FALSE),\"\")","v":""},null,null,null,null,null,null,null,null,"--"]
[null,"R28",{"$f":"IF(ISTEXT(VLOOKUP(B603,'FICHA DE PROJETO'!$A$581:$I$761,2,FALSE)),VLOOKUP(B603,'FICHA DE PROJETO'!$A$581:$I$761,2,FALSE),\"\")","v":""},null,null,null,null,null,null,null,null,"--"]
[null,"R29",{"$f":"IF(ISTEXT(VLOOKUP(B604,'FICHA DE PROJETO'!$A$581:$I$761,2,FALSE)),VLOOKUP(B604,'FICHA DE PROJETO'!$A$581:$I$761,2,FALSE),\"\")","v":""},null,null,null,null,null,null,null,null,"--"]
[null,"R30",{"$f":"IF(ISTEXT(VLOOKUP(B605,'FICHA DE PROJETO'!$A$581:$I$761,2,FALSE)),VLOOKUP(B605,'FICHA DE PROJETO'!$A$581:$I$761,2,FALSE),\"\")","v":""},null,null,null,null,null,null,null,null,"--"]
[null,"R31",{"$f":"IF(ISTEXT(VLOOKUP(B606,'FICHA DE PROJETO'!$A$581:$I$761,2,FALSE)),VLOOKUP(B606,'FICHA DE PROJETO'!$A$581:$I$761,2,FALSE),\"\")","v":""},null,null,null,null,null,null,null,null,"--"]
[null,"R32",{"$f":"IF(ISTEXT(VLOOKUP(B607,'FICHA DE PROJETO'!$A$581:$I$761,2,FALSE)),VLOOKUP(B607,'FICHA DE PROJETO'!$A$581:$I$761,2,FALSE),\"\")","v":""},null,null,null,null,null,null,null,null,"--"]
[null,"R33",{"$f":"IF(ISTEXT(VLOOKUP(B608,'FICHA DE PROJETO'!$A$581:$I$761,2,FALSE)),VLOOKUP(B608,'FICHA DE PROJETO'!$A$581:$I$761,2,FALSE),\"\")","v":""},null,null,null,null,null,null,null,null,"--"]
[null,"R34",{"$f":"IF(ISTEXT(VLOOKUP(B609,'FICHA DE PROJETO'!$A$581:$I$761,2,FALSE)),VLOOKUP(B609,'FICHA DE PROJETO'!$A$581:$I$761,2,FALSE),\"\")","v":""},null,null,null,null,null,null,null,null,"--"]
[null,"R35",{"$f":"IF(ISTEXT(VLOOKUP(B610,'FICHA DE PROJETO'!$A$581:$I$761,2,FALSE)),VLOOKUP(B610,'FICHA DE PROJETO'!$A$581:$I$761,2,FALSE),\"\")","v":""},null,null,null,null,null,null,null,null,{"$f":"IF(C610=\"\",\"--\",\"X\")","v":"--"}]
[null,"R36",{"$f":"IF(ISTEXT(VLOOKUP(B611,'FICHA DE PROJETO'!$A$581:$I$761,2,FALSE)),VLOOKUP(B611,'FICHA DE PROJETO'!$A$581:$I$761,2,FALSE),\"\")","v":""},null,null,null,null,null,null,null,null,"--"]
[null,"R37",{"$f":"IF(ISTEXT(VLOOKUP(B612,'FICHA DE PROJETO'!$A$581:$I$761,2,FALSE)),VLOOKUP(B612,'FICHA DE PROJETO'!$A$581:$I$761,2,FALSE),\"\")","v":""},null,null,null,null,null,null,null,null,"--"]
[null,"R38",{"$f":"IF(ISTEXT(VLOOKUP(B613,'FICHA DE PROJETO'!$A$581:$I$761,2,FALSE)),VLOOKUP(B613,'FICHA DE PROJETO'!$A$581:$I$761,2,FALSE),\"\")","v":""},null,null,null,null,null,null,null,null,"--"]
[null,"R39",{"$f":"IF(ISTEXT(VLOOKUP(B614,'FICHA DE PROJETO'!$A$581:$I$761,2,FALSE)),VLOOKUP(B614,'FICHA DE PROJETO'!$A$581:$I$761,2,FALSE),\"\")","v":""},null,null,null,null,null,null,null,null,"--"]
[null,"R40",{"$f":"IF(ISTEXT(VLOOKUP(B615,'FICHA DE PROJETO'!$A$581:$I$761,2,FALSE)),VLOOKUP(B615,'FICHA DE PROJETO'!$A$581:$I$761,2,FALSE),\"\")","v":""},null,null,null,null,null,null,null,null,"--"]
[null,"R41",{"$f":"IF(ISTEXT(VLOOKUP(B616,'FICHA DE PROJETO'!$A$581:$I$761,2,FALSE)),VLOOKUP(B616,'FICHA DE PROJETO'!$A$581:$I$761,2,FALSE),\"\")","v":""},null,null,null,null,null,null,null,null,"--"]
[null,"R42",{"$f":"IF(ISTEXT(VLOOKUP(B617,'FICHA DE PROJETO'!$A$581:$I$761,2,FALSE)),VLOOKUP(B617,'FICHA DE PROJETO'!$A$581:$I$761,2,FALSE),\"\")","v":""},null,null,null,null,null,null,null,null,"--"]
[null,"R43",{"$f":"IF(ISTEXT(VLOOKUP(B618,'FICHA DE PROJETO'!$A$581:$I$761,2,FALSE)),VLOOKUP(B618,'FICHA DE PROJETO'!$A$581:$I$761,2,FALSE),\"\")","v":""},null,null,null,null,null,null,null,null,"--"]
[null,"R44",{"$f":"IF(ISTEXT(VLOOKUP(B619,'FICHA DE PROJETO'!$A$581:$I$761,2,FALSE)),VLOOKUP(B619,'FICHA DE PROJETO'!$A$581:$I$761,2,FALSE),\"\")","v":""},null,null,null,null,null,null,null,null,"--"]
[null,"R45",{"$f":"IF(ISTEXT(VLOOKUP(B620,'FICHA DE PROJETO'!$A$581:$I$761,2,FALSE)),VLOOKUP(B620,'FICHA DE PROJETO'!$A$581:$I$761,2,FALSE),\"\")","v":""},null,null,null,null,null,null,null,null,"--"]
[null,"R46",{"$f":"IF(ISTEXT(VLOOKUP(B621,'FICHA DE PROJETO'!$A$581:$I$761,2,FALSE)),VLOOKUP(B621,'FICHA DE PROJETO'!$A$581:$I$761,2,FALSE),\"\")","v":""},null,null,null,null,null,null,null,null,"--"]
[null,"R47",{"$f":"IF(ISTEXT(VLOOKUP(B622,'FICHA DE PROJETO'!$A$581:$I$761,2,FALSE)),VLOOKUP(B622,'FICHA DE PROJETO'!$A$581:$I$761,2,FALSE),\"\")","v":""},null,null,null,null,null,null,null,null,"--"]
[null,"R48",{"$f":"IF(ISTEXT(VLOOKUP(B623,'FICHA DE PROJETO'!$A$581:$I$761,2,FALSE)),VLOOKUP(B623,'FICHA DE PROJETO'!$A$581:$I$761,2,FALSE),\"\")","v":""},null,null,null,null,null,null,null,null,"--"]
[null,"R49",{"$f":"IF(ISTEXT(VLOOKUP(B624,'FICHA DE PROJETO'!$A$581:$I$761,2,FALSE)),VLOOKUP(B624,'FICHA DE PROJETO'!$A$581:$I$761,2,FALSE),\"\")","v":""},null,null,null,null,null,null,null,null,"--"]
[null,"R50",{"$f":"IF(ISTEXT(VLOOKUP(B625,'FICHA DE PROJETO'!$A$581:$I$761,2,FALSE)),VLOOKUP(B625,'FICHA DE PROJETO'!$A$581:$I$761,2,FALSE),\"\")","v":""},null,null,null,null,null,null,null,null,"--"]
[null,"R51",{"$f":"IF(ISTEXT(VLOOKUP(B626,'FICHA DE PROJETO'!$A$581:$I$761,2,FALSE)),VLOOKUP(B626,'FICHA DE PROJETO'!$A$581:$I$761,2,FALSE),\"\")","v":""},null,null,null,null,null,null,null,null,"--"]
[null,"R52",{"$f":"IF(ISTEXT(VLOOKUP(B627,'FICHA DE PROJETO'!$A$581:$I$761,2,FALSE)),VLOOKUP(B627,'FICHA DE PROJETO'!$A$581:$I$761,2,FALSE),\"\")","v":""},null,null,null,null,null,null,null,null,"--"]
[null,"R53",{"$f":"IF(ISTEXT(VLOOKUP(B628,'FICHA DE PROJETO'!$A$581:$I$761,2,FALSE)),VLOOKUP(B628,'FICHA DE PROJETO'!$A$581:$I$761,2,FALSE),\"\")","v":""},null,null,null,null,null,null,null,null,"--"]
[null,"R54",{"$f":"IF(ISTEXT(VLOOKUP(B629,'FICHA DE PROJETO'!$A$581:$I$761,2,FALSE)),VLOOKUP(B629,'FICHA DE PROJETO'!$A$581:$I$761,2,FALSE),\"\")","v":""},null,null,null,null,null,null,null,null,"--"]
[null,"R55",{"$f":"IF(ISTEXT(VLOOKUP(B630,'FICHA DE PROJETO'!$A$581:$I$761,2,FALSE)),VLOOKUP(B630,'FICHA DE PROJETO'!$A$581:$I$761,2,FALSE),\"\")","v":""},null,null,null,null,null,null,null,null,"--"]
[null,"R56",{"$f":"IF(ISTEXT(VLOOKUP(B631,'FICHA DE PROJETO'!$A$581:$I$761,2,FALSE)),VLOOKUP(B631,'FICHA DE PROJETO'!$A$581:$I$761,2,FALSE),\"\")","v":""},null,null,null,null,null,null,null,null,"--"]
[null,"R57",{"$f":"IF(ISTEXT(VLOOKUP(B632,'FICHA DE PROJETO'!$A$581:$I$761,2,FALSE)),VLOOKUP(B632,'FICHA DE PROJETO'!$A$581:$I$761,2,FALSE),\"\")","v":""},null,null,null,null,null,null,null,null,"--"]
[null,"R58",{"$f":"IF(ISTEXT(VLOOKUP(B633,'FICHA DE PROJETO'!$A$581:$I$761,2,FALSE)),VLOOKUP(B633,'FICHA DE PROJETO'!$A$581:$I$761,2,FALSE),\"\")","v":""},null,null,null,null,null,null,null,null,"--"]
[null,"R59",{"$f":"IF(ISTEXT(VLOOKUP(B634,'FICHA DE PROJETO'!$A$581:$I$761,2,FALSE)),VLOOKUP(B634,'FICHA DE PROJETO'!$A$581:$I$761,2,FALSE),\"\")","v":""},null,null,null,null,null,null,null,null,"--"]
[null,"R60",{"$f":"IF(ISTEXT(VLOOKUP(B635,'FICHA DE PROJETO'!$A$581:$I$761,2,FALSE)),VLOOKUP(B635,'FICHA DE PROJETO'!$A$581:$I$761,2,FALSE),\"\")","v":""},null,null,null,null,null,null,null,null,"--"]
[null,"R61",{"$f":"IF(ISTEXT(VLOOKUP(B636,'FICHA DE PROJETO'!$A$581:$I$761,2,FALSE)),VLOOKUP(B636,'FICHA DE PROJETO'!$A$581:$I$761,2,FALSE),\"\")","v":""},null,null,null,null,null,null,null,null,"--"]
[null,"R62",{"$f":"IF(ISTEXT(VLOOKUP(B637,'FICHA DE PROJETO'!$A$581:$I$761,2,FALSE)),VLOOKUP(B637,'FICHA DE PROJETO'!$A$581:$I$761,2,FALSE),\"\")","v":""},null,null,null,null,null,null,null,null,"--"]
[null,"R63",{"$f":"IF(ISTEXT(VLOOKUP(B638,'FICHA DE PROJETO'!$A$581:$I$761,2,FALSE)),VLOOKUP(B638,'FICHA DE PROJETO'!$A$581:$I$761,2,FALSE),\"\")","v":""},null,null,null,null,null,null,null,null,"--"]
[null,"R64",{"$f":"IF(ISTEXT(VLOOKUP(B639,'FICHA DE PROJETO'!$A$581:$I$761,2,FALSE)),VLOOKUP(B639,'FICHA DE PROJETO'!$A$581:$I$761,2,FALSE),\"\")","v":""},null,null,null,null,null,null,null,null,"--"]
[null,"R65",{"$f":"IF(ISTEXT(VLOOKUP(B640,'FICHA DE PROJETO'!$A$581:$I$761,2,FALSE)),VLOOKUP(B640,'FICHA DE PROJETO'!$A$581:$I$761,2,FALSE),\"\")","v":""},null,null,null,null,null,null,null,null,"--"]
[null,"R66",{"$f":"IF(ISTEXT(VLOOKUP(B641,'FICHA DE PROJETO'!$A$581:$I$761,2,FALSE)),VLOOKUP(B641,'FICHA DE PROJETO'!$A$581:$I$761,2,FALSE),\"\")","v":""},null,null,null,null,null,null,null,null,"--"]
[null,"R67",{"$f":"IF(ISTEXT(VLOOKUP(B642,'FICHA DE PROJETO'!$A$581:$I$761,2,FALSE)),VLOOKUP(B642,'FICHA DE PROJETO'!$A$581:$I$761,2,FALSE),\"\")","v":""},null,null,null,null,null,null,null,null,"--"]
[null,"R68",{"$f":"IF(ISTEXT(VLOOKUP(B643,'FICHA DE PROJETO'!$A$581:$I$761,2,FALSE)),VLOOKUP(B643,'FICHA DE PROJETO'!$A$581:$I$761,2,FALSE),\"\")","v":""},null,null,null,null,null,null,null,null,"--"]
[null,"R69",{"$f":"IF(ISTEXT(VLOOKUP(B644,'FICHA DE PROJETO'!$A$581:$I$761,2,FALSE)),VLOOKUP(B644,'FICHA DE PROJETO'!$A$581:$I$761,2,FALSE),\"\")","v":""},null,null,null,null,null,null,null,null,"--"]
[null,"R70",{"$f":"IF(ISTEXT(VLOOKUP(B645,'FICHA DE PROJETO'!$A$581:$I$761,2,FALSE)),VLOOKUP(B645,'FICHA DE PROJETO'!$A$581:$I$761,2,FALSE),\"\")","v":""},null,null,null,null,null,null,null,null,"--"]
[null,"R71",{"$f":"IF(ISTEXT(VLOOKUP(B646,'FICHA DE PROJETO'!$A$581:$I$761,2,FALSE)),VLOOKUP(B646,'FICHA DE PROJETO'!$A$581:$I$761,2,FALSE),\"\")","v":""},null,null,null,null,null,null,null,null,"--"]
[null,"R72",{"$f":"IF(ISTEXT(VLOOKUP(B647,'FICHA DE PROJETO'!$A$581:$I$761,2,FALSE)),VLOOKUP(B647,'FICHA DE PROJETO'!$A$581:$I$761,2,FALSE),\"\")","v":""},null,null,null,null,null,null,null,null,"--"]
[null,"R73",{"$f":"IF(ISTEXT(VLOOKUP(B648,'FICHA DE PROJETO'!$A$581:$I$761,2,FALSE)),VLOOKUP(B648,'FICHA DE PROJETO'!$A$581:$I$761,2,FALSE),\"\")","v":""},null,null,null,null,null,null,null,null,"--"]
[null,"R74",{"$f":"IF(ISTEXT(VLOOKUP(B649,'FICHA DE PROJETO'!$A$581:$I$761,2,FALSE)),VLOOKUP(B649,'FICHA DE PROJETO'!$A$581:$I$761,2,FALSE),\"\")","v":""},null,null,null,null,null,null,null,null,"--"]
[null,"R75",{"$f":"IF(ISTEXT(VLOOKUP(B650,'FICHA DE PROJETO'!$A$581:$I$761,2,FALSE)),VLOOKUP(B650,'FICHA DE PROJETO'!$A$581:$I$761,2,FALSE),\"\")","v":""},null,null,null,null,null,null,null,null,"--"]
[null,"R76",{"$f":"IF(ISTEXT(VLOOKUP(B651,'FICHA DE PROJETO'!$A$581:$I$761,2,FALSE)),VLOOKUP(B651,'FICHA DE PROJETO'!$A$581:$I$761,2,FALSE),\"\")","v":""},null,null,null,null,null,null,null,null,"--"]
[null,"R77",{"$f":"IF(ISTEXT(VLOOKUP(B652,'FICHA DE PROJETO'!$A$581:$I$761,2,FALSE)),VLOOKUP(B652,'FICHA DE PROJETO'!$A$581:$I$761,2,FALSE),\"\")","v":""},null,null,null,null,null,null,null,null,"--"]
[null,"R78",{"$f":"IF(ISTEXT(VLOOKUP(B653,'FICHA DE PROJETO'!$A$581:$I$761,2,FALSE)),VLOOKUP(B653,'FICHA DE PROJETO'!$A$581:$I$761,2,FALSE),\"\")","v":""},null,null,null,null,null,null,null,null,"--"]
[null,"R79",{"$f":"IF(ISTEXT(VLOOKUP(B654,'FICHA DE PROJETO'!$A$581:$I$761,2,FALSE)),VLOOKUP(B654,'FICHA DE PROJETO'!$A$581:$I$761,2,FALSE),\"\")","v":""},null,null,null,null,null,null,null,null,"--"]
[null,"R80",{"$f":"IF(ISTEXT(VLOOKUP(B655,'FICHA DE PROJETO'!$A$581:$I$761,2,FALSE)),VLOOKUP(B655,'FICHA DE PROJETO'!$A$581:$I$761,2,FALSE),\"\")","v":""},null,null,null,null,null,null,null,null,"--"]
[null,"R81",{"$f":"IF(ISTEXT(VLOOKUP(B656,'FICHA DE PROJETO'!$A$581:$I$761,2,FALSE)),VLOOKUP(B656,'FICHA DE PROJETO'!$A$581:$I$761,2,FALSE),\"\")","v":""},null,null,null,null,null,null,null,null,"--"]
[null,"R82",{"$f":"IF(ISTEXT(VLOOKUP(B657,'FICHA DE PROJETO'!$A$581:$I$761,2,FALSE)),VLOOKUP(B657,'FICHA DE PROJETO'!$A$581:$I$761,2,FALSE),\"\")","v":""},null,null,null,null,null,null,null,null,"--"]
[null,"R83",{"$f":"IF(ISTEXT(VLOOKUP(B658,'FICHA DE PROJETO'!$A$581:$I$761,2,FALSE)),VLOOKUP(B658,'FICHA DE PROJETO'!$A$581:$I$761,2,FALSE),\"\")","v":""},null,null,null,null,null,null,null,null,"--"]
[null,"R84",{"$f":"IF(ISTEXT(VLOOKUP(B659,'FICHA DE PROJETO'!$A$581:$I$761,2,FALSE)),VLOOKUP(B659,'FICHA DE PROJETO'!$A$581:$I$761,2,FALSE),\"\")","v":""},null,null,null,null,null,null,null,null,"--"]
[null,"R85",{"$f":"IF(ISTEXT(VLOOKUP(B660,'FICHA DE PROJETO'!$A$581:$I$761,2,FALSE)),VLOOKUP(B660,'FICHA DE PROJETO'!$A$581:$I$761,2,FALSE),\"\")","v":""},null,null,null,null,null,null,null,null,"--"]
[null,"R86",{"$f":"IF(ISTEXT(VLOOKUP(B661,'FICHA DE PROJETO'!$A$581:$I$761,2,FALSE)),VLOOKUP(B661,'FICHA DE PROJETO'!$A$581:$I$761,2,FALSE),\"\")","v":""},null,null,null,null,null,null,null,null,"--"]
[null,"R87",{"$f":"IF(ISTEXT(VLOOKUP(B662,'FICHA DE PROJETO'!$A$581:$I$761,2,FALSE)),VLOOKUP(B662,'FICHA DE PROJETO'!$A$581:$I$761,2,FALSE),\"\")","v":""},null,null,null,null,null,null,null,null,"--"]
[null,"R88",{"$f":"IF(ISTEXT(VLOOKUP(B663,'FICHA DE PROJETO'!$A$581:$I$761,2,FALSE)),VLOOKUP(B663,'FICHA DE PROJETO'!$A$581:$I$761,2,FALSE),\"\")","v":""},null,null,null,null,null,null,null,null,"--"]
[null,"R89",{"$f":"IF(ISTEXT(VLOOKUP(B664,'FICHA DE PROJETO'!$A$581:$I$761,2,FALSE)),VLOOKUP(B664,'FICHA DE PROJETO'!$A$581:$I$761,2,FALSE),\"\")","v":""},null,null,null,null,null,null,null,null,"--"]
[null,"R90",{"$f":"IF(ISTEXT(VLOOKUP(B665,'FICHA DE PROJETO'!$A$581:$I$761,2,FALSE)),VLOOKUP(B665,'FICHA DE PROJETO'!$A$581:$I$761,2,FALSE),\"\")","v":""},null,null,null,null,null,null,null,null,"--"]
[null,"R91",{"$f":"IF(ISTEXT(VLOOKUP(B666,'FICHA DE PROJETO'!$A$581:$I$761,2,FALSE)),VLOOKUP(B666,'FICHA DE PROJETO'!$A$581:$I$761,2,FALSE),\"\")","v":""},null,null,null,null,null,null,null,null,"--"]
[null,"R92",{"$f":"IF(ISTEXT(VLOOKUP(B667,'FICHA DE PROJETO'!$A$581:$I$761,2,FALSE)),VLOOKUP(B667,'FICHA DE PROJETO'!$A$581:$I$761,2,FALSE),\"\")","v":""},null,null,null,null,null,null,null,null,"--"]
[null,"R93",{"$f":"IF(ISTEXT(VLOOKUP(B668,'FICHA DE PROJETO'!$A$581:$I$761,2,FALSE)),VLOOKUP(B668,'FICHA DE PROJETO'!$A$581:$I$761,2,FALSE),\"\")","v":""},null,null,null,null,null,null,null,null,"--"]
[null,"R94",{"$f":"IF(ISTEXT(VLOOKUP(B669,'FICHA DE PROJETO'!$A$581:$I$761,2,FALSE)),VLOOKUP(B669,'FICHA DE PROJETO'!$A$581:$I$761,2,FALSE),\"\")","v":""},null,null,null,null,null,null,null,null,"--"]
[null,"R95",{"$f":"IF(ISTEXT(VLOOKUP(B670,'FICHA DE PROJETO'!$A$581:$I$761,2,FALSE)),VLOOKUP(B670,'FICHA DE PROJETO'!$A$581:$I$761,2,FALSE),\"\")","v":""},null,null,null,null,null,null,null,null,"--"]
[null,"R96",{"$f":"IF(ISTEXT(VLOOKUP(B671,'FICHA DE PROJETO'!$A$581:$I$761,2,FALSE)),VLOOKUP(B671,'FICHA DE PROJETO'!$A$581:$I$761,2,FALSE),\"\")","v":""},null,null,null,null,null,null,null,null,"--"]
[null,"R97",{"$f":"IF(ISTEXT(VLOOKUP(B672,'FICHA DE PROJETO'!$A$581:$I$761,2,FALSE)),VLOOKUP(B672,'FICHA DE PROJETO'!$A$581:$I$761,2,FALSE),\"\")","v":""},null,null,null,null,null,null,null,null,"--"]
[null,"R98",{"$f":"IF(ISTEXT(VLOOKUP(B673,'FICHA DE PROJETO'!$A$581:$I$761,2,FALSE)),VLOOKUP(B673,'FICHA DE PROJETO'!$A$581:$I$761,2,FALSE),\"\")","v":""},null,null,null,null,null,null,null,null,"--"]
[null,"R99",{"$f":"IF(ISTEXT(VLOOKUP(B674,'FICHA DE PROJETO'!$A$581:$I$761,2,FALSE)),VLOOKUP(B674,'FICHA DE PROJETO'!$A$581:$I$761,2,FALSE),\"\")","v":""},null,null,null,null,null,null,null,null,{"$f":"IF(C674=\"\",\"--\",\"X\")","v":"--"}]
[null,"R100",{"$f":"IF(ISTEXT(VLOOKUP(B675,'FICHA DE PROJETO'!$A$581:$I$761,2,FALSE)),VLOOKUP(B675,'FICHA DE PROJETO'!$A$581:$I$761,2,FALSE),\"\")","v":""},null,null,null,null,null,null,null,null,"--"]
[null,"R101",{"$f":"IF(ISTEXT(VLOOKUP(B676,'FICHA DE PROJETO'!$A$581:$I$761,2,FALSE)),VLOOKUP(B676,'FICHA DE PROJETO'!$A$581:$I$761,2,FALSE),\"\")","v":""},null,null,null,null,null,null,null,null,"--"]
[null,"R102",{"$f":"IF(ISTEXT(VLOOKUP(B677,'FICHA DE PROJETO'!$A$581:$I$761,2,FALSE)),VLOOKUP(B677,'FICHA DE PROJETO'!$A$581:$I$761,2,FALSE),\"\")","v":""},null,null,null,null,null,null,null,null,"--"]
[null,"R103",{"$f":"IF(ISTEXT(VLOOKUP(B678,'FICHA DE PROJETO'!$A$581:$I$761,2,FALSE)),VLOOKUP(B678,'FICHA DE PROJETO'!$A$581:$I$761,2,FALSE),\"\")","v":""},null,null,null,null,null,null,null,null,"--"]
[null,"R104",{"$f":"IF(ISTEXT(VLOOKUP(B679,'FICHA DE PROJETO'!$A$581:$I$761,2,FALSE)),VLOOKUP(B679,'FICHA DE PROJETO'!$A$581:$I$761,2,FALSE),\"\")","v":""},null,null,null,null,null,null,null,null,"--"]
[null,"R105",{"$f":"IF(ISTEXT(VLOOKUP(B680,'FICHA DE PROJETO'!$A$581:$I$761,2,FALSE)),VLOOKUP(B680,'FICHA DE PROJETO'!$A$581:$I$761,2,FALSE),\"\")","v":""},null,null,null,null,null,null,null,null,"--"]
[null,"R106",{"$f":"IF(ISTEXT(VLOOKUP(B681,'FICHA DE PROJETO'!$A$581:$I$761,2,FALSE)),VLOOKUP(B681,'FICHA DE PROJETO'!$A$581:$I$761,2,FALSE),\"\")","v":""},null,null,null,null,null,null,null,null,"--"]
[null,"R107",{"$f":"IF(ISTEXT(VLOOKUP(B682,'FICHA DE PROJETO'!$A$581:$I$761,2,FALSE)),VLOOKUP(B682,'FICHA DE PROJETO'!$A$581:$I$761,2,FALSE),\"\")","v":""},null,null,null,null,null,null,null,null,"--"]
[null,"R108",{"$f":"IF(ISTEXT(VLOOKUP(B683,'FICHA DE PROJETO'!$A$581:$I$761,2,FALSE)),VLOOKUP(B683,'FICHA DE PROJETO'!$A$581:$I$761,2,FALSE),\"\")","v":""},null,null,null,null,null,null,null,null,"--"]
[null,"R109",{"$f":"IF(ISTEXT(VLOOKUP(B684,'FICHA DE PROJETO'!$A$581:$I$761,2,FALSE)),VLOOKUP(B684,'FICHA DE PROJETO'!$A$581:$I$761,2,FALSE),\"\")","v":""},null,null,null,null,null,null,null,null,"--"]
[null,"R110",{"$f":"IF(ISTEXT(VLOOKUP(B685,'FICHA DE PROJETO'!$A$581:$I$761,2,FALSE)),VLOOKUP(B685,'FICHA DE PROJETO'!$A$581:$I$761,2,FALSE),\"\")","v":""},null,null,null,null,null,null,null,null,"--"]
[null,"R111",{"$f":"IF(ISTEXT(VLOOKUP(B686,'FICHA DE PROJETO'!$A$581:$I$761,2,FALSE)),VLOOKUP(B686,'FICHA DE PROJETO'!$A$581:$I$761,2,FALSE),\"\")","v":""},null,null,null,null,null,null,null,null,"--"]
[null,"R112",{"$f":"IF(ISTEXT(VLOOKUP(B687,'FICHA DE PROJETO'!$A$581:$I$761,2,FALSE)),VLOOKUP(B687,'FICHA DE PROJETO'!$A$581:$I$761,2,FALSE),\"\")","v":""},null,null,null,null,null,null,null,null,"--"]
[null,"R113",{"$f":"IF(ISTEXT(VLOOKUP(B688,'FICHA DE PROJETO'!$A$581:$I$761,2,FALSE)),VLOOKUP(B688,'FICHA DE PROJETO'!$A$581:$I$761,2,FALSE),\"\")","v":""},null,null,null,null,null,null,null,null,"--"]
[null,"R114",{"$f":"IF(ISTEXT(VLOOKUP(B689,'FICHA DE PROJETO'!$A$581:$I$761,2,FALSE)),VLOOKUP(B689,'FICHA DE PROJETO'!$A$581:$I$761,2,FALSE),\"\")","v":""},null,null,null,null,null,null,null,null,"--"]
[null,"R115",{"$f":"IF(ISTEXT(VLOOKUP(B690,'FICHA DE PROJETO'!$A$581:$I$761,2,FALSE)),VLOOKUP(B690,'FICHA DE PROJETO'!$A$581:$I$761,2,FALSE),\"\")","v":""},null,null,null,null,null,null,null,null,"--"]
[null,"R116",{"$f":"IF(ISTEXT(VLOOKUP(B691,'FICHA DE PROJETO'!$A$581:$I$761,2,FALSE)),VLOOKUP(B691,'FICHA DE PROJETO'!$A$581:$I$761,2,FALSE),\"\")","v":""},null,null,null,null,null,null,null,null,"--"]
[null,"R117",{"$f":"IF(ISTEXT(VLOOKUP(B692,'FICHA DE PROJETO'!$A$581:$I$761,2,FALSE)),VLOOKUP(B692,'FICHA DE PROJETO'!$A$581:$I$761,2,FALSE),\"\")","v":""},null,null,null,null,null,null,null,null,"--"]
[null,"R118",{"$f":"IF(ISTEXT(VLOOKUP(B693,'FICHA DE PROJETO'!$A$581:$I$761,2,FALSE)),VLOOKUP(B693,'FICHA DE PROJETO'!$A$581:$I$761,2,FALSE),\"\")","v":""},null,null,null,null,null,null,null,null,"--"]
[null,"R119",{"$f":"IF(ISTEXT(VLOOKUP(B694,'FICHA DE PROJETO'!$A$581:$I$761,2,FALSE)),VLOOKUP(B694,'FICHA DE PROJETO'!$A$581:$I$761,2,FALSE),\"\")","v":""},null,null,null,null,null,null,null,null,"--"]
[null,"R120",{"$f":"IF(ISTEXT(VLOOKUP(B695,'FICHA DE PROJETO'!$A$581:$I$761,2,FALSE)),VLOOKUP(B695,'FICHA DE PROJETO'!$A$581:$I$761,2,FALSE),\"\")","v":""},null,null,null,null,null,null,null,null,"--"]
[null,"R121",{"$f":"IF(ISTEXT(VLOOKUP(B696,'FICHA DE PROJETO'!$A$581:$I$761,2,FALSE)),VLOOKUP(B696,'FICHA DE PROJETO'!$A$581:$I$761,2,FALSE),\"\")","v":""},null,null,null,null,null,null,null,null,"--"]
[null,"R122",{"$f":"IF(ISTEXT(VLOOKUP(B697,'FICHA DE PROJETO'!$A$581:$I$761,2,FALSE)),VLOOKUP(B697,'FICHA DE PROJETO'!$A$581:$I$761,2,FALSE),\"\")","v":""},null,null,null,null,null,null,null,null,"--"]
[null,"R123",{"$f":"IF(ISTEXT(VLOOKUP(B698,'FICHA DE PROJETO'!$A$581:$I$761,2,FALSE)),VLOOKUP(B698,'FICHA DE PROJETO'!$A$581:$I$761,2,FALSE),\"\")","v":""},null,null,null,null,null,null,null,null,"--"]
[null,"R124",{"$f":"IF(ISTEXT(VLOOKUP(B699,'FICHA DE PROJETO'!$A$581:$I$761,2,FALSE)),VLOOKUP(B699,'FICHA DE PROJETO'!$A$581:$I$761,2,FALSE),\"\")","v":""},null,null,null,null,null,null,null,null,"--"]
[null,"R125",{"$f":"IF(ISTEXT(VLOOKUP(B700,'FICHA DE PROJETO'!$A$581:$I$761,2,FALSE)),VLOOKUP(B700,'FICHA DE PROJETO'!$A$581:$I$761,2,FALSE),\"\")","v":""},null,null,null,null,null,null,null,null,"--"]
[null,"R126",{"$f":"IF(ISTEXT(VLOOKUP(B701,'FICHA DE PROJETO'!$A$581:$I$761,2,FALSE)),VLOOKUP(B701,'FICHA DE PROJETO'!$A$581:$I$761,2,FALSE),\"\")","v":""},null,null,null,null,null,null,null,null,"--"]
[null,"R127",{"$f":"IF(ISTEXT(VLOOKUP(B702,'FICHA DE PROJETO'!$A$581:$I$761,2,FALSE)),VLOOKUP(B702,'FICHA DE PROJETO'!$A$581:$I$761,2,FALSE),\"\")","v":""},null,null,null,null,null,null,null,null,"--"]
[null,"R128",{"$f":"IF(ISTEXT(VLOOKUP(B703,'FICHA DE PROJETO'!$A$581:$I$761,2,FALSE)),VLOOKUP(B703,'FICHA DE PROJETO'!$A$581:$I$761,2,FALSE),\"\")","v":""},null,null,null,null,null,null,null,null,"--"]
[null,"R129",{"$f":"IF(ISTEXT(VLOOKUP(B704,'FICHA DE PROJETO'!$A$581:$I$761,2,FALSE)),VLOOKUP(B704,'FICHA DE PROJETO'!$A$581:$I$761,2,FALSE),\"\")","v":""},null,null,null,null,null,null,null,null,"--"]
[null,"R130",{"$f":"IF(ISTEXT(VLOOKUP(B705,'FICHA DE PROJETO'!$A$581:$I$761,2,FALSE)),VLOOKUP(B705,'FICHA DE PROJETO'!$A$581:$I$761,2,FALSE),\"\")","v":""},null,null,null,null,null,null,null,null,"--"]
[null,"R131",{"$f":"IF(ISTEXT(VLOOKUP(B706,'FICHA DE PROJETO'!$A$581:$I$761,2,FALSE)),VLOOKUP(B706,'FICHA DE PROJETO'!$A$581:$I$761,2,FALSE),\"\")","v":""},null,null,null,null,null,null,null,null,"--"]
[null,"R132",{"$f":"IF(ISTEXT(VLOOKUP(B707,'FICHA DE PROJETO'!$A$581:$I$761,2,FALSE)),VLOOKUP(B707,'FICHA DE PROJETO'!$A$581:$I$761,2,FALSE),\"\")","v":""},null,null,null,null,null,null,null,null,"--"]
[null,"R133",{"$f":"IF(ISTEXT(VLOOKUP(B708,'FICHA DE PROJETO'!$A$581:$I$761,2,FALSE)),VLOOKUP(B708,'FICHA DE PROJETO'!$A$581:$I$761,2,FALSE),\"\")","v":""},null,null,null,null,null,null,null,null,"--"]
[null,"R134",{"$f":"IF(ISTEXT(VLOOKUP(B709,'FICHA DE PROJETO'!$A$581:$I$761,2,FALSE)),VLOOKUP(B709,'FICHA DE PROJETO'!$A$581:$I$761,2,FALSE),\"\")","v":""},null,null,null,null,null,null,null,null,"--"]
[null,"R135",{"$f":"IF(ISTEXT(VLOOKUP(B710,'FICHA DE PROJETO'!$A$581:$I$761,2,FALSE)),VLOOKUP(B710,'FICHA DE PROJETO'!$A$581:$I$761,2,FALSE),\"\")","v":""},null,null,null,null,null,null,null,null,"--"]
[null,"R136",{"$f":"IF(ISTEXT(VLOOKUP(B711,'FICHA DE PROJETO'!$A$581:$I$761,2,FALSE)),VLOOKUP(B711,'FICHA DE PROJETO'!$A$581:$I$761,2,FALSE),\"\")","v":""},null,null,null,null,null,null,null,null,"--"]
[null,"R137",{"$f":"IF(ISTEXT(VLOOKUP(B712,'FICHA DE PROJETO'!$A$581:$I$761,2,FALSE)),VLOOKUP(B712,'FICHA DE PROJETO'!$A$581:$I$761,2,FALSE),\"\")","v":""},null,null,null,null,null,null,null,null,"--"]
[null,"R138",{"$f":"IF(ISTEXT(VLOOKUP(B713,'FICHA DE PROJETO'!$A$581:$I$761,2,FALSE)),VLOOKUP(B713,'FICHA DE PROJETO'!$A$581:$I$761,2,FALSE),\"\")","v":""},null,null,null,null,null,null,null,null,"--"]
[null,"R139",{"$f":"IF(ISTEXT(VLOOKUP(B714,'FICHA DE PROJETO'!$A$581:$I$761,2,FALSE)),VLOOKUP(B714,'FICHA DE PROJETO'!$A$581:$I$761,2,FALSE),\"\")","v":""},null,null,null,null,null,null,null,null,"--"]
[null,"R140",{"$f":"IF(ISTEXT(VLOOKUP(B715,'FICHA DE PROJETO'!$A$581:$I$761,2,FALSE)),VLOOKUP(B715,'FICHA DE PROJETO'!$A$581:$I$761,2,FALSE),\"\")","v":""},null,null,null,null,null,null,null,null,"--"]
[null,"R141",{"$f":"IF(ISTEXT(VLOOKUP(B716,'FICHA DE PROJETO'!$A$581:$I$761,2,FALSE)),VLOOKUP(B716,'FICHA DE PROJETO'!$A$581:$I$761,2,FALSE),\"\")","v":""},null,null,null,null,null,null,null,null,"--"]
[null,"R142",{"$f":"IF(ISTEXT(VLOOKUP(B717,'FICHA DE PROJETO'!$A$581:$I$761,2,FALSE)),VLOOKUP(B717,'FICHA DE PROJETO'!$A$581:$I$761,2,FALSE),\"\")","v":""},null,null,null,null,null,null,null,null,"--"]
[null,"R143",{"$f":"IF(ISTEXT(VLOOKUP(B718,'FICHA DE PROJETO'!$A$581:$I$761,2,FALSE)),VLOOKUP(B718,'FICHA DE PROJETO'!$A$581:$I$761,2,FALSE),\"\")","v":""},null,null,null,null,null,null,null,null,"--"]
[null,"R144",{"$f":"IF(ISTEXT(VLOOKUP(B719,'FICHA DE PROJETO'!$A$581:$I$761,2,FALSE)),VLOOKUP(B719,'FICHA DE PROJETO'!$A$581:$I$761,2,FALSE),\"\")","v":""},null,null,null,null,null,null,null,null,"--"]
[null,"R145",{"$f":"IF(ISTEXT(VLOOKUP(B720,'FICHA DE PROJETO'!$A$581:$I$761,2,FALSE)),VLOOKUP(B720,'FICHA DE PROJETO'!$A$581:$I$761,2,FALSE),\"\")","v":""},null,null,null,null,null,null,null,null,"--"]
[null,"R146",{"$f":"IF(ISTEXT(VLOOKUP(B721,'FICHA DE PROJETO'!$A$581:$I$761,2,FALSE)),VLOOKUP(B721,'FICHA DE PROJETO'!$A$581:$I$761,2,FALSE),\"\")","v":""},null,null,null,null,null,null,null,null,"--"]
[null,"R147",{"$f":"IF(ISTEXT(VLOOKUP(B722,'FICHA DE PROJETO'!$A$581:$I$761,2,FALSE)),VLOOKUP(B722,'FICHA DE PROJETO'!$A$581:$I$761,2,FALSE),\"\")","v":""},null,null,null,null,null,null,null,null,"--"]
[null,"R148",{"$f":"IF(ISTEXT(VLOOKUP(B723,'FICHA DE PROJETO'!$A$581:$I$761,2,FALSE)),VLOOKUP(B723,'FICHA DE PROJETO'!$A$581:$I$761,2,FALSE),\"\")","v":""},null,null,null,null,null,null,null,null,"--"]
[null,"R149",{"$f":"IF(ISTEXT(VLOOKUP(B724,'FICHA DE PROJETO'!$A$581:$I$761,2,FALSE)),VLOOKUP(B724,'FICHA DE PROJETO'!$A$581:$I$761,2,FALSE),\"\")","v":""},null,null,null,null,null,null,null,null,"--"]
[null,"R150",{"$f":"IF(ISTEXT(VLOOKUP(B725,'FICHA DE PROJETO'!$A$581:$I$761,2,FALSE)),VLOOKUP(B725,'FICHA DE PROJETO'!$A$581:$I$761,2,FALSE),\"\")","v":""},null,null,null,null,null,null,null,null,"--"]
[null,"R151",{"$f":"IF(ISTEXT(VLOOKUP(B726,'FICHA DE PROJETO'!$A$581:$I$761,2,FALSE)),VLOOKUP(B726,'FICHA DE PROJETO'!$A$581:$I$761,2,FALSE),\"\")","v":""},null,null,null,null,null,null,null,null,"--"]
[null,"R152",{"$f":"IF(ISTEXT(VLOOKUP(B727,'FICHA DE PROJETO'!$A$581:$I$761,2,FALSE)),VLOOKUP(B727,'FICHA DE PROJETO'!$A$581:$I$761,2,FALSE),\"\")","v":""},null,null,null,null,null,null,null,null,"--"]
[null,"R153",{"$f":"IF(ISTEXT(VLOOKUP(B728,'FICHA DE PROJETO'!$A$581:$I$761,2,FALSE)),VLOOKUP(B728,'FICHA DE PROJETO'!$A$581:$I$761,2,FALSE),\"\")","v":""},null,null,null,null,null,null,null,null,"--"]
[null,"R154",{"$f":"IF(ISTEXT(VLOOKUP(B729,'FICHA DE PROJETO'!$A$581:$I$761,2,FALSE)),VLOOKUP(B729,'FICHA DE PROJETO'!$A$581:$I$761,2,FALSE),\"\")","v":""},null,null,null,null,null,null,null,null,"--"]
[null,"R155",{"$f":"IF(ISTEXT(VLOOKUP(B730,'FICHA DE PROJETO'!$A$581:$I$761,2,FALSE)),VLOOKUP(B730,'FICHA DE PROJETO'!$A$581:$I$761,2,FALSE),\"\")","v":""},null,null,null,null,null,null,null,null,"--"]
[null,"R156",{"$f":"IF(ISTEXT(VLOOKUP(B731,'FICHA DE PROJETO'!$A$581:$I$761,2,FALSE)),VLOOKUP(B731,'FICHA DE PROJETO'!$A$581:$I$761,2,FALSE),\"\")","v":""},null,null,null,null,null,null,null,null,"--"]
[null,"R157",{"$f":"IF(ISTEXT(VLOOKUP(B732,'FICHA DE PROJETO'!$A$581:$I$761,2,FALSE)),VLOOKUP(B732,'FICHA DE PROJETO'!$A$581:$I$761,2,FALSE),\"\")","v":""},null,null,null,null,null,null,null,null,"--"]
[null,"R158",{"$f":"IF(ISTEXT(VLOOKUP(B733,'FICHA DE PROJETO'!$A$581:$I$761,2,FALSE)),VLOOKUP(B733,'FICHA DE PROJETO'!$A$581:$I$761,2,FALSE),\"\")","v":""},null,null,null,null,null,null,null,null,"--"]
[null,"R159",{"$f":"IF(ISTEXT(VLOOKUP(B734,'FICHA DE PROJETO'!$A$581:$I$761,2,FALSE)),VLOOKUP(B734,'FICHA DE PROJETO'!$A$581:$I$761,2,FALSE),\"\")","v":""},null,null,null,null,null,null,null,null,"--"]
[null,"R160",{"$f":"IF(ISTEXT(VLOOKUP(B735,'FICHA DE PROJETO'!$A$581:$I$761,2,FALSE)),VLOOKUP(B735,'FICHA DE PROJETO'!$A$581:$I$761,2,FALSE),\"\")","v":""},null,null,null,null,null,null,null,null,"--"]
[null,"R161",{"$f":"IF(ISTEXT(VLOOKUP(B736,'FICHA DE PROJETO'!$A$581:$I$761,2,FALSE)),VLOOKUP(B736,'FICHA DE PROJETO'!$A$581:$I$761,2,FALSE),\"\")","v":""},null,null,null,null,null,null,null,null,"--"]
[null,"R162",{"$f":"IF(ISTEXT(VLOOKUP(B737,'FICHA DE PROJETO'!$A$581:$I$761,2,FALSE)),VLOOKUP(B737,'FICHA DE PROJETO'!$A$581:$I$761,2,FALSE),\"\")","v":""},null,null,null,null,null,null,null,null,"--"]
[null,"R163",{"$f":"IF(ISTEXT(VLOOKUP(B738,'FICHA DE PROJETO'!$A$581:$I$761,2,FALSE)),VLOOKUP(B738,'FICHA DE PROJETO'!$A$581:$I$761,2,FALSE),\"\")","v":""},null,null,null,null,null,null,null,null,{"$f":"IF(C738=\"\",\"--\",\"X\")","v":"--"}]
[null,"R164",{"$f":"IF(ISTEXT(VLOOKUP(B739,'FICHA DE PROJETO'!$A$581:$I$761,2,FALSE)),VLOOKUP(B739,'FICHA DE PROJETO'!$A$581:$I$761,2,FALSE),\"\")","v":""},null,null,null,null,null,null,null,null,"--"]
[null,"R165",{"$f":"IF(ISTEXT(VLOOKUP(B740,'FICHA DE PROJETO'!$A$581:$I$761,2,FALSE)),VLOOKUP(B740,'FICHA DE PROJETO'!$A$581:$I$761,2,FALSE),\"\")","v":""},null,null,null,null,null,null,null,null,"--"]
[null,"R166",{"$f":"IF(ISTEXT(VLOOKUP(B741,'FICHA DE PROJETO'!$A$581:$I$761,2,FALSE)),VLOOKUP(B741,'FICHA DE PROJETO'!$A$581:$I$761,2,FALSE),\"\")","v":""},null,null,null,null,null,null,null,null,"--"]
[null,"R167",{"$f":"IF(ISTEXT(VLOOKUP(B742,'FICHA DE PROJETO'!$A$581:$I$761,2,FALSE)),VLOOKUP(B742,'FICHA DE PROJETO'!$A$581:$I$761,2,FALSE),\"\")","v":""},null,null,null,null,null,null,null,null,"--"]
[null,"R168",{"$f":"IF(ISTEXT(VLOOKUP(B743,'FICHA DE PROJETO'!$A$581:$I$761,2,FALSE)),VLOOKUP(B743,'FICHA DE PROJETO'!$A$581:$I$761,2,FALSE),\"\")","v":""},null,null,null,null,null,null,null,null,"--"]
[null,"R169",{"$f":"IF(ISTEXT(VLOOKUP(B744,'FICHA DE PROJETO'!$A$581:$I$761,2,FALSE)),VLOOKUP(B744,'FICHA DE PROJETO'!$A$581:$I$761,2,FALSE),\"\")","v":""},null,null,null,null,null,null,null,null,"--"]
[null,"R170",{"$f":"IF(ISTEXT(VLOOKUP(B745,'FICHA DE PROJETO'!$A$581:$I$761,2,FALSE)),VLOOKUP(B745,'FICHA DE PROJETO'!$A$581:$I$761,2,FALSE),\"\")","v":""},null,null,null,null,null,null,null,null,"--"]
[null,"R171",{"$f":"IF(ISTEXT(VLOOKUP(B746,'FICHA DE PROJETO'!$A$581:$I$761,2,FALSE)),VLOOKUP(B746,'FICHA DE PROJETO'!$A$581:$I$761,2,FALSE),\"\")","v":""},null,null,null,null,null,null,null,null,"--"]
[null,"R172",{"$f":"IF(ISTEXT(VLOOKUP(B747,'FICHA DE PROJETO'!$A$581:$I$761,2,FALSE)),VLOOKUP(B747,'FICHA DE PROJETO'!$A$581:$I$761,2,FALSE),\"\")","v":""},null,null,null,null,null,null,null,null,"--"]
[null,"R173",{"$f":"IF(ISTEXT(VLOOKUP(B748,'FICHA DE PROJETO'!$A$581:$I$761,2,FALSE)),VLOOKUP(B748,'FICHA DE PROJETO'!$A$581:$I$761,2,FALSE),\"\")","v":""},null,null,null,null,null,null,null,null,"--"]
[null,"R174",{"$f":"IF(ISTEXT(VLOOKUP(B749,'FICHA DE PROJETO'!$A$581:$I$761,2,FALSE)),VLOOKUP(B749,'FICHA DE PROJETO'!$A$581:$I$761,2,FALSE),\"\")","v":""},null,null,null,null,null,null,null,null,"--"]
[null,"R175",{"$f":"IF(ISTEXT(VLOOKUP(B750,'FICHA DE PROJETO'!$A$581:$I$761,2,FALSE)),VLOOKUP(B750,'FICHA DE PROJETO'!$A$581:$I$761,2,FALSE),\"\")","v":""},null,null,null,null,null,null,null,null,"--"]
[null,"R176",{"$f":"IF(ISTEXT(VLOOKUP(B751,'FICHA DE PROJETO'!$A$581:$I$761,2,FALSE)),VLOOKUP(B751,'FICHA DE PROJETO'!$A$581:$I$761,2,FALSE),\"\")","v":""},null,null,null,null,null,null,null,null,"--"]
[null,"R177",{"$f":"IF(ISTEXT(VLOOKUP(B752,'FICHA DE PROJETO'!$A$581:$I$761,2,FALSE)),VLOOKUP(B752,'FICHA DE PROJETO'!$A$581:$I$761,2,FALSE),\"\")","v":""},null,null,null,null,null,null,null,null,"--"]
[null,"R178",{"$f":"IF(ISTEXT(VLOOKUP(B753,'FICHA DE PROJETO'!$A$581:$I$761,2,FALSE)),VLOOKUP(B753,'FICHA DE PROJETO'!$A$581:$I$761,2,FALSE),\"\")","v":""},null,null,null,null,null,null,null,null,"--"]
[null,"R179",{"$f":"IF(ISTEXT(VLOOKUP(B754,'FICHA DE PROJETO'!$A$581:$I$761,2,FALSE)),VLOOKUP(B754,'FICHA DE PROJETO'!$A$581:$I$761,2,FALSE),\"\")","v":""},null,null,null,null,null,null,null,null,"--"]
[null,"R180",{"$f":"IF(ISTEXT(VLOOKUP(B755,'FICHA DE PROJETO'!$A$581:$I$761,2,FALSE)),VLOOKUP(B755,'FICHA DE PROJETO'!$A$581:$I$761,2,FALSE),\"\")","v":""},null,null,null,null,null,null,null,null,"--"]
[null,null,null,null,null,null,null,null,null,null,null,"X"]
["Ꙭ ALERTA →","AS RUAS SERÃO PREENCHIDAS AUTOMATICAMENTE. Volte para a FICHA DE PROJETO e digite o Nº de LOTES DO PROJETO; Preencha Nº da Rua (R01; R02;...) e preencher o Nome da Rua e trecho respectivo.",null,null,null,null,null,null,null,null,null,{"$f":"IF('FICHA DE PROJETO'!C31,\"VAZIA\",\"X\")","v":"VAZIA"}]
[null,null,null,null,null,null,null,null,null,null,null,{"$f":"IF('FICHA DE PROJETO'!C31,\"VAZIA\",\"X\")","v":"VAZIA"}]
["04. ÁREA/ QUANTIDADE",null,null,null,null,null,null,null,null,null,null,"X"]
["Área/Quantidade TOTAL:",null,{"$f":"SUM(C761:D764)","v":10892.7},null,null,null,"Extensão TOTAL:",null,{"$f":"SUM(I761:J764)","v":0},null,null,"X"]
["Área/Quantidade LOTE 1:",null,{"$f":"'FICHA DE PROJETO'!C765","v":10892.7},null,null,null,"Extensão:",null,{"$f":"'FICHA DE PROJETO'!I765","v":0},null,null,{"$f":"IF('FICHA DE PROJETO'!$C$31>0,\"x\",\"vazia\")","v":"x"}]
["Área/Quantidade LOTE 2:",null,{"$f":"'FICHA DE PROJETO'!C766","v":0},null,null,null,"Extensão:",null,{"$f":"'FICHA DE PROJETO'!I766","v":0},null,null,{"$f":"IF('FICHA DE PROJETO'!$C$31>1,\"x\",\"vazia\")","v":"vazia"}]
["Área/Quantidade LOTE 3:",null,{"$f":"'FICHA DE PROJETO'!C767","v":0},null,null,null,"Extensão:",null,{"$f":"'FICHA DE PROJETO'!I767","v":0},null,null,{"$f":"IF('FICHA DE PROJETO'!$C$31>2,\"x\",\"vazia\")","v":"vazia"}]
["Área/Quantidade LOTE 4:",null,{"$f":"'FICHA DE PROJETO'!C768","v":0},null,null,null,"Extensão:",null,{"$f":"'FICHA DE PROJETO'!I768","v":0},null,null,{"$f":"IF('FICHA DE PROJETO'!$C$31>3,\"x\",\"vazia\")","v":"vazia"}]
[null,null,null,null,null,null,null,null,null,null,null,"X"]
["Ꙭ ALERTA →","ANTES DE PROSSEGUIR, volte para a FICHA DE PROJETO e digite o Nº de LOTES DO PROJETO.",null,null,null,null,null,null,null,null,null,{"$f":"IF('FICHA DE PROJETO'!C31,\"VAZIA\",\"X\")","v":"VAZIA"}]
["05. OBSERVÂNCIA À LEI DO SISTEMA VIÁRIO",null,null,null,null,null,null,null,null,null,null,"X"]
[null,null,null,null,null,null,null,null,null,null,null,"X"]
["Nº da Lei do Sistema Viário Municipal:",null,null,null,null,"Lei nº 798/2007",null,null,null,null,null,"X"]
["Data de Aprovação da Lei:",null,null,null,null,"2007-04-05",null,null,null,null,null,"X"]
[null,null,null,null,null,null,null,null,"SIM","NÃO",null,"X"]
["O projeto apresentado atende a Lei do Sistema Viário Municipal?",null,null,null,null,null,null,null,"X",null,null,"X"]
["Justifique sua Resposta:",null,null,null,null,null,null,null,null,null,null,"X"]
["O projeto atendeu às dimensões mínimas previstas na LSV nº 798/2007.",null,null,null,null,null,null,null,null,null,null,"X"]
[null,null,null,null,null,null,null,null,null,null,null,"X"]
[null,null,null,null,null,null,null,null,null,null,null,"X"]
["06. IDENTIFICAÇÃO DA VIA A SER PAVIMENTADA",null,null,null,null,null,null,null,null,null,null,"X"]
["COMPATIBILIDADE COM A HIERARQUIA SEGUNDO LEGISLAÇÃO MUNICIPAL",null,null,null,null,null,null,null,null,null,null,"X"]
[null,null,null,null,null,null,null,null,null,null,null,"X"]
["O Projeto trata-se de recape asfáltico sobre pedras irregulares em vias já consolidadas."]
[]
["RUAS DO LOTE 01",null,null,null,null,null,null,null,null,null,null,"X"]
["R01",{"$f":"IF(ISTEXT(VLOOKUP(A783,'FICHA DE PROJETO'!$A$33:$I$213,2,FALSE)),VLOOKUP(A783,'FICHA DE PROJETO'!$A$33:$I$213,2,FALSE),\"\")","v":"RUA VITAL PIRES DE LIMA entre a Avenida Paraná e Rua Silvio Picinini;"},null,null,null,null,null,null,null,null,null,{"$f":"IF((B783=\"\"),\"--\",\"X\")","v":"X"}]
[null,null,"LEI",null,"PROJETO","ATENDEU À LEGISLAÇÃO",null,null,"NÃO ATENDEU À LEGISLAÇÃO",null,null,{"$f":"L783","v":"X"}]
["Caracterização da Via: ",null,"LOCAL",null,"LOCAL",{"$f":"IF(ISBLANK(C785),\"\",(IF((C785=E785),\"X\",\"\")))","v":"X"},null,null,{"$f":"IF(NOT(C785=E785),\"X\",\"\")","v":""},null,null,{"$f":"L784","v":"X"},"CARACTERIZAÇÃO DA VIA: Ordenamento de vias segundo grau de importância para o sistema viário;"]
["Largura da Caixa da Via:",null,12,null,12,{"$f":"IF(ISBLANK(C786),\"\",(IF((C786=E786),\"X\",\"\")))","v":"X"},null,null,{"$f":"IF(ISBLANK(C786),\"\",(IF((C786>E786),\"X\",\"\")))","v":""},null,null,{"$f":"L785","v":"X"},"CAIXA DA VIA: distância entre os lotes lindeiros situados em lados opostos da via"]
["Largura da Pista ",null,7,null,8,"",null,null,"",null,null,"X","PISTA - parte da via normalmente utilizada para a circulação de veículos, identificada por elementos separadores ou por diferença de nível em relação às calçadas, ilhas ou aos canteiros centrais"]
["Largura da calçada",null,2.5,null,2.5,"X",null,null,"",null,null,"X","CALÇADA - parte da via, normalmente segregada e em nível diferente, não destinada à circulação de veículos, reservada ao trânsito de pedestres e, quando possível, à implantação de mobiliário urbano, sinalização, vegetação e outros fins."]
["Largura do passeio",null,1.2,null,2,"",null,null,"",null,null,"X","PASSEIO - parte da calçada ou da pista de rolamento, neste último caso, separada por pintura ou elemento físico separador, livre de interferências, destinada à circulação exclusiva de pedestres e, excepcionalmente, de ciclistas."]
["Ciclovia",null,null,null,null,"",null,null,"",null,null,"X","CICLOVIA - pista própria destinada à circulação de ciclos, separada fisicamente do tráfego comum"]
["Ciclofaixa",null,null,null,null,{"$f":"IF(ISBLANK(C791),\"\",(IF((C791<=E791),\"X\",\"\")))","v":""},null,null,"",null,null,"X","CICLOFAIXA - parte da pista de rolamento destinada à circulação exclusiva de ciclos, delimitada por sinalização específica"]
[null,null,null,null,null,null,null,null,null,null,null,{"$f":"L791","v":"X"}]
["R02",{"$f":"IF(ISTEXT(VLOOKUP(A793,'FICHA DE PROJETO'!$A$33:$I$213,2,FALSE)),VLOOKUP(A793,'FICHA DE PROJETO'!$A$33:$I$213,2,FALSE),\"\")","v":"RUA MATIAS APARECIDO FOGAÇA entre as Ruas Vital Pires de Lima e Ângelo Bianco;"},null,null,null,null,null,null,null,null,null,{"$f":"IF((B793=\"\"),\"--\",\"X\")","v":"X"}]
[null,null,"LEI",null,"PROJETO","ATENDEU À LEGISLAÇÃO",null,null,"NÃO ATENDEU À LEGISLAÇÃO",null,null,{"$f":"L793","v":"X"}]
["Caracterização da Via: ",null,"LOCAL",null,"LOCAL",{"$f":"IF(ISBLANK(C795),\"\",(IF((C795=E795),\"X\",\"\")))","v":"X"},null,null,{"$f":"IF(NOT(C795=E795),\"X\",\"\")","v":""},null,null,{"$f":"L794","v":"X"}]
["Largura da Caixa da Via:",null,12,null,12,{"$f":"IF(ISBLANK(C796),\"\",(IF((C796<=E796),\"X\",\"\")))","v":"X"},null,null,{"$f":"IF(ISBLANK(C796),\"\",(IF((C796>E796),\"X\",\"\")))","v":""},null,null,{"$f":"L795","v":"X"}]
["Largura da Pista ",null,7,null,8,{"$f":"IF(ISBLANK(C797),\"\",(IF((C797<=E797),\"X\",\"\")))","v":"X"},null,null,"",null,null,"X"]
["Largura da calçada",null,2.5,null,2.5,"X",null,null,"",null,null,"X"]
["Largura do passeio",null,1.2,null,2,"X",null,null,"",null,null,"X"]
["Ciclovia",null,null,null,null,"",null,null,"",null,null,"X"]
["Ciclofaixa",null,null,null,null,"",null,null,"",null,null,"X"]
[null,null,null,null,null,null,null,null,null,null,null,{"$f":"L801","v":"X"}]
["R03",{"$f":"IF(ISTEXT(VLOOKUP(A803,'FICHA DE PROJETO'!$A$33:$I$213,2,FALSE)),VLOOKUP(A803,'FICHA DE PROJETO'!$A$33:$I$213,2,FALSE),\"\")","v":"RUA SÍLVIO PICININI entre as Ruas Vital Pires de Lima e Virgínio Turozi;"},null,null,null,null,null,null,null,null,null,{"$f":"IF((B803=\"\"),\"--\",\"X\")","v":"X"}]
[null,null,"LEI",null,"PROJETO","ATENDEU À LEGISLAÇÃO",null,null,"NÃO ATENDEU À LEGISLAÇÃO",null,null,{"$f":"L803","v":"X"}]
["Caracterização da Via: ",null,"LOCAL",null,"LOCAL",{"$f":"IF(ISBLANK(C805),\"\",(IF((C805=E805),\"X\",\"\")))","v":"X"},null,null,{"$f":"IF(NOT(C805=E805),\"X\",\"\")","v":""},null,null,{"$f":"L804","v":"X"}]
["Largura da Caixa da Via:",null,12,null,12,{"$f":"IF(ISBLANK(C806),\"\",(IF((C806<=E806),\"X\",\"\")))","v":"X"},null,null,{"$f":"IF(ISBLANK(C806),\"\",(IF((C806>E806),\"X\",\"\")))","v":""},null,null,{"$f":"L805","v":"X"}]
["Largura da Pista ",null,7,null,9.1999999999999993,"X",null,null,"",null,null,"X"]
["Largura da calçada",null,2.5,null,2.5,"X",null,null,"",null,null,"X"]
["Largura do passeio",null,1.2,null,2,"X",null,null,"",null,null,"X"]
["Ciclovia",null,null,null,null,"",null,null,"",null,null,"X"]
["Ciclofaixa",null,null,null,null,"",null,null,"",null,null,"X"]
[null,null,null,null,null,null,null,null,null,null,null,{"$f":"L811","v":"X"}]
["R04",{"$f":"IF(ISTEXT(VLOOKUP(A813,'FICHA DE PROJETO'!$A$33:$I$213,2,FALSE)),VLOOKUP(A813,'FICHA DE PROJETO'!$A$33:$I$213,2,FALSE),\"\")","v":"RUA HÉLIO BARCO entre as Ruas Angelo Bianco e Virgínio Turozi;"},null,null,null,null,null,null,null,null,null,{"$f":"IF((B813=\"\"),\"--\",\"X\")","v":"X"}]
[null,null,"LEI",null,"PROJETO","ATENDEU À LEGISLAÇÃO",null,null,"NÃO ATENDEU À LEGISLAÇÃO",null,null,{"$f":"L813","v":"X"}]
["Caracterização da Via: ",null,"LOCAL",null,"LOCAL",{"$f":"IF(ISBLANK(C815),\"\",(IF((C815=E815),\"X\",\"\")))","v":"X"},null,null,{"$f":"IF(NOT(C815=E815),\"X\",\"\")","v":""},null,null,{"$f":"L814","v":"X"}]
["Largura da Caixa da Via:",null,12,null,12,{"$f":"IF(ISBLANK(C816),\"\",(IF((C816<=E816),\"X\",\"\")))","v":"X"},null,null,{"$f":"IF(ISBLANK(C816),\"\",(IF((C816>E816),\"X\",\"\")))","v":""},null,null,{"$f":"L815","v":"X"}]
["Largura da Pista ",null,7,null,9.1999999999999993,"X",null,null,"",null,null,"X"]
["Largura da calçada",null,2.5,null,2.5,"X",null,null,"",null,null,"X"]
["Largura do passeio",null,1.2,null,2,"X",null,null,"",null,null,"X"]
["Ciclovia",null,null,null,null,"",null,null,"",null,null,"X"]
["Ciclofaixa",null,null,null,null,"",null,null,"",null,null,"X"]
[null,null,null,null,null,null,null,null,null,null,null,{"$f":"L821","v":"X"}]
["R05",{"$f":"IF(ISTEXT(VLOOKUP(A823,'FICHA DE PROJETO'!$A$33:$I$213,2,FALSE)),VLOOKUP(A823,'FICHA DE PROJETO'!$A$33:$I$213,2,FALSE),\"\")","v":"RUA ÂNGELO BIANCO entre as Ruas Sílvio Picinini e Hélio Barco."},null,null,null,null,null,null,null,null,null,{"$f":"IF((B823=\"\"),\"--\",\"X\")","v":"X"}]
[null,null,"LEI",null,"PROJETO","ATENDEU À LEGISLAÇÃO",null,null,"NÃO ATENDEU À LEGISLAÇÃO",null,null,{"$f":"L823","v":"X"}]
["Caracterização da Via: ",null,"LOCAL",null,"LOCAL",{"$f":"IF(ISBLANK(C825),\"\",(IF((C825=E825),\"X\",\"\")))","v":"X"},null,null,{"$f":"IF(NOT(C825=E825),\"X\",\"\")","v":""},null,null,{"$f":"L824","v":"X"}]
["Largura da Caixa da Via:",null,12,null,12,{"$f":"IF(ISBLANK(C826),\"\",(IF((C826<=E826),\"X\",\"\")))","v":"X"},null,null,{"$f":"IF(ISBLANK(C826),\"\",(IF((C826>E826),\"X\",\"\")))","v":""},null,null,{"$f":"L825","v":"X"}]
["Largura da Pista ",null,7,null,8,"X",null,null,"",null,null,"X"]
["Largura da calçada",null,2.5,null,2.5,"X",null,null,"",null,null,"X"]
["Largura do passeio",null,1.2,null,2,"X",null,null,"",null,null,"X"]
["Ciclovia",null,null,null,null,"",null,null,"",null,null,"X"]
["Ciclofaixa",null,null,null,null,"",null,null,"",null,null,"X"]
[null,null,null,null,null,null,null,null,null,null,null,{"$f":"L831","v":"X"}]
["R06",{"$f":"IF(ISTEXT(VLOOKUP(A833,'FICHA DE PROJETO'!$A$33:$I$213,2,FALSE)),VLOOKUP(A833,'FICHA DE PROJETO'!$A$33:$I$213,2,FALSE),\"\")","v":"RUA PROJETADA \"A\" entre as Ruaas Sílvio Picinini e Hélio Barco;"},null,null,null,null,null,null,null,null,null,{"$f":"IF((B833=\"\"),\"--\",\"X\")","v":"X"}]
[null,null,"LEI",null,"PROJETO","ATENDEU À LEGISLAÇÃO",null,null,"NÃO ATENDEU À LEGISLAÇÃO",null,null,{"$f":"L833","v":"X"}]
["Caracterização da Via: ",null,"LOCAL",null,"LOCAL",{"$f":"IF(ISBLANK(C835),\"\",(IF((C835=E835),\"X\",\"\")))","v":"X"},null,null,{"$f":"IF(NOT(C835=E835),\"X\",\"\")","v":""},null,null,{"$f":"L834","v":"X"}]
["Largura da Caixa da Via:",null,12,null,12,{"$f":"IF(ISBLANK(C836),\"\",(IF((C836<=E836),\"X\",\"\")))","v":"X"},null,null,{"$f":"IF(ISBLANK(C836),\"\",(IF((C836>E836),\"X\",\"\")))","v":""},null,null,{"$f":"L835","v":"X"}]
["Largura da Pista ",null,7,null,7,"X",null,null,"",null,null,"X"]
["Largura da calçada",null,2.5,null,2.5,"X",null,null,"",null,null,"X"]
["Largura do passeio",null,1.2,null,2,"X",null,null,"",null,null,"X"]
["Ciclovia",null,null,null,null,"",null,null,"",null,null,"X"]
["Ciclofaixa",null,null,null,null,"",null,null,"",null,null,"X"]
[null,null,null,null,null,null,null,null,null,null,null,{"$f":"L841","v":"X"}]
["R07",{"$f":"IF(ISTEXT(VLOOKUP(A843,'FICHA DE PROJETO'!$A$33:$I$213,2,FALSE)),VLOOKUP(A843,'FICHA DE PROJETO'!$A$33:$I$213,2,FALSE),\"\")","v":"RUA HELENA DEOTTI COSTA com início na Rua João Sperandio até o final a 100,00m;"},null,null,null,null,null,null,null,null,null,{"$f":"IF((B843=\"\"),\"--\",\"X\")","v":"X"}]
[null,null,"LEI",null,"PROJETO","ATENDEU À LEGISLAÇÃO",null,null,"NÃO ATENDEU À LEGISLAÇÃO",null,null,{"$f":"L843","v":"X"}]
["Caracterização da Via: ",null,"LOCAL",null,"LOCAL",{"$f":"IF(ISBLANK(C845),\"\",(IF((C845=E845),\"X\",\"\")))","v":"X"},null,null,{"$f":"IF(NOT(C845=E845),\"X\",\"\")","v":""},null,null,{"$f":"L844","v":"X"}]
["Largura da Caixa da Via:",null,12,null,12,{"$f":"IF(ISBLANK(C846),\"\",(IF((C846<=E846),\"X\",\"\")))","v":"X"},null,null,{"$f":"IF(ISBLANK(C846),\"\",(IF((C846>E846),\"X\",\"\")))","v":""},null,null,{"$f":"L845","v":"X"}]
["Largura da Pista ",null,7,null,7,"X",null,null,"",null,null,"X"]
["Largura da calçada",null,2.5,null,2.5,"X",null,null,"",null,null,"X"]
["Largura do passeio",null,1.2,null,2,"X",null,null,"",null,null,"X"]
["Ciclovia",null,null,null,null,"",null,null,"",null,null,"X"]
["Ciclofaixa",null,null,null,null,"",null,null,"",null,null,"X"]
[null,null,null,null,null,null,null,null,null,null,null,{"$f":"L851","v":"X"}]
["R08",{"$f":"IF(ISTEXT(VLOOKUP(A853,'FICHA DE PROJETO'!$A$33:$I$213,2,FALSE)),VLOOKUP(A853,'FICHA DE PROJETO'!$A$33:$I$213,2,FALSE),\"\")","v":"RUA BOIADEIRO entre a Rua Dionísio Ternulina da Silva e Travessa \"C\"."},null,null,null,null,null,null,null,null,null,{"$f":"IF((B853=\"\"),\"--\",\"X\")","v":"X"}]
[null,null,"LEI",null,"PROJETO","ATENDEU À LEGISLAÇÃO",null,null,"NÃO ATENDEU À LEGISLAÇÃO",null,null,{"$f":"L853","v":"X"}]
["Caracterização da Via: ",null,"LOCAL",null,"LOCAL",{"$f":"IF(ISBLANK(C855),\"\",(IF((C855=E855),\"X\",\"\")))","v":"X"},null,null,{"$f":"IF(NOT(C855=E855),\"X\",\"\")","v":""},null,null,{"$f":"L854","v":"X"}]
["Largura da Caixa da Via:",null,12,null,12,{"$f":"IF(ISBLANK(C856),\"\",(IF((C856<=E856),\"X\",\"\")))","v":"X"},null,null,{"$f":"IF(ISBLANK(C856),\"\",(IF((C856>E856),\"X\",\"\")))","v":""},null,null,{"$f":"L855","v":"X"}]
["Largura da Pista ",null,7,null,7,"X",null,null,"",null,null,"X"]
["Largura da calçada",null,2.5,null,2.5,"X",null,null,"",null,null,"X"]
["Largura do passeio",null,1.2,null,2,"X",null,null,"",null,null,"X"]
["Ciclovia",null,null,null,null,"",null,null,"",null,null,"X"]
["Ciclofaixa",null,null,null,null,"",null,null,"",null,null,"X"]
[null,null,null,null,null,null,null,null,null,null,null,{"$f":"L861","v":"X"}]
["R09",{"$f":"IF(ISTEXT(VLOOKUP(A863,'FICHA DE PROJETO'!$A$33:$I$213,2,FALSE)),VLOOKUP(A863,'FICHA DE PROJETO'!$A$33:$I$213,2,FALSE),\"\")","v":""},null,null,null,null,null,null,null,null,null,{"$f":"IF((B863=\"\"),\"--\",\"X\")","v":"--"}]
[null,null,"LEI",null,"PROJETO","ATENDEU À LEGISLAÇÃO",null,null,"NÃO ATENDEU À LEGISLAÇÃO",null,null,{"$f":"L863","v":"--"}]
["Caracterização da Via: ",null,null,null,null,{"$f":"IF(ISBLANK(C865),\"\",(IF((C865=E865),\"X\",\"\")))","v":""},null,null,{"$f":"IF(NOT(C865=E865),\"X\",\"\")","v":""},null,null,{"$f":"L864","v":"--"}]
["Largura da Caixa da Via:",null,null,null,null,{"$f":"IF(ISBLANK(C866),\"\",(IF((C866<=E866),\"X\",\"\")))","v":""},null,null,{"$f":"IF(ISBLANK(C866),\"\",(IF((C866>E866),\"X\",\"\")))","v":""},null,null,{"$f":"L865","v":"--"}]
["Largura da Pista ",null,null,null,null,"",null,null,"",null,null,"--"]
["Largura da calçada",null,null,null,null,"",null,null,"",null,null,"--"]
["Largura do passeio",null,null,null,null,"",null,null,"",null,null,"--"]
["Ciclovia",null,null,null,null,{"$f":"IF(ISBLANK(C870),\"\",(IF((C870<=E870),\"X\",\"\")))","v":""},null,null,"",null,null,"--"]
["Ciclofaixa",null,null,null,null,"",null,null,"",null,null,"--"]
[null,null,null,null,null,null,null,null,null,null,null,{"$f":"L871","v":"--"}]
["R10",{"$f":"IF(ISTEXT(VLOOKUP(A873,'FICHA DE PROJETO'!$A$33:$I$213,2,FALSE)),VLOOKUP(A873,'FICHA DE PROJETO'!$A$33:$I$213,2,FALSE),\"\")","v":""},null,null,null,null,null,null,null,null,null,{"$f":"IF((B873=\"\"),\"--\",\"X\")","v":"--"}]
[null,null,"LEI",null,"PROJETO","ATENDEU À LEGISLAÇÃO",null,null,"NÃO ATENDEU À LEGISLAÇÃO",null,null,{"$f":"L873","v":"--"}]
["Caracterização da Via: ",null,null,null,null,{"$f":"IF(ISBLANK(C875),\"\",(IF((C875=E875),\"X\",\"\")))","v":""},null,null,{"$f":"IF(NOT(C875=E875),\"X\",\"\")","v":""},null,null,{"$f":"L874","v":"--"}]
["Largura da Caixa da Via:",null,null,null,null,{"$f":"IF(ISBLANK(C876),\"\",(IF((C876<=E876),\"X\",\"\")))","v":""},null,null,{"$f":"IF(ISBLANK(C876),\"\",(IF((C876>E876),\"X\",\"\")))","v":""},null,null,{"$f":"L875","v":"--"}]
["Largura da Pista ",null,null,null,null,"",null,null,"",null,null,"--"]
["Largura da calçada",null,null,null,null,"",null,null,"",null,null,"--"]
["Largura do passeio",null,null,null,null,"",null,null,"",null,null,"--"]
["Ciclovia",null,null,null,null,{"$f":"IF(ISBLANK(C880),\"\",(IF((C880<=E880),\"X\",\"\")))","v":""},null,null,"",null,null,"--"]
["Ciclofaixa",null,null,null,null,{"$f":"IF(ISBLANK(C881),\"\",(IF((C881<=E881),\"X\",\"\")))","v":""},null,null,"",null,null,"--"]
[null,null,null,null,null,null,null,null,null,null,null,{"$f":"L881","v":"--"}]
["R11",{"$f":"IF(ISTEXT(VLOOKUP(A883,'FICHA DE PROJETO'!$A$33:$I$213,2,FALSE)),VLOOKUP(A883,'FICHA DE PROJETO'!$A$33:$I$213,2,FALSE),\"\")","v":""},null,null,null,null,null,null,null,null,null,{"$f":"IF((B883=\"\"),\"--\",\"X\")","v":"--"}]
[null,null,"LEI",null,"PROJETO","ATENDEU À LEGISLAÇÃO",null,null,"NÃO ATENDEU À LEGISLAÇÃO",null,null,{"$f":"L883","v":"--"}]
["Caracterização da Via: ",null,null,null,null,{"$f":"IF(ISBLANK(C885),\"\",(IF((C885=E885),\"X\",\"\")))","v":""},null,null,{"$f":"IF(NOT(C885=E885),\"X\",\"\")","v":""},null,null,{"$f":"L884","v":"--"}]
["Largura da Caixa da Via:",null,null,null,null,{"$f":"IF(ISBLANK(C886),\"\",(IF((C886<=E886),\"X\",\"\")))","v":""},null,null,{"$f":"IF(ISBLANK(C886),\"\",(IF((C886>E886),\"X\",\"\")))","v":""},null,null,{"$f":"L885","v":"--"}]
["Largura da Pista ",null,null,null,null,"",null,null,"",null,null,"--"]
["Largura da calçada",null,null,null,null,"",null,null,"",null,null,"--"]
["Largura do passeio",null,null,null,null,"",null,null,"",null,null,"--"]
["Ciclovia",null,null,null,null,{"$f":"IF(ISBLANK(C890),\"\",(IF((C890<=E890),\"X\",\"\")))","v":""},null,null,"",null,null,"--"]
["Ciclofaixa",null,null,null,null,{"$f":"IF(ISBLANK(C891),\"\",(IF((C891<=E891),\"X\",\"\")))","v":""},null,null,"",null,null,"--"]
[null,null,null,null,null,null,null,null,null,null,null,{"$f":"L891","v":"--"}]
["R12",{"$f":"IF(ISTEXT(VLOOKUP(A893,'FICHA DE PROJETO'!$A$33:$I$213,2,FALSE)),VLOOKUP(A893,'FICHA DE PROJETO'!$A$33:$I$213,2,FALSE),\"\")","v":""},null,null,null,null,null,null,null,null,null,{"$f":"IF((B893=\"\"),\"--\",\"X\")","v":"--"}]
[null,null,"LEI",null,"PROJETO","ATENDEU À LEGISLAÇÃO",null,null,"NÃO ATENDEU À LEGISLAÇÃO",null,null,{"$f":"L893","v":"--"}]
["Caracterização da Via: ",null,null,null,null,{"$f":"IF(ISBLANK(C895),\"\",(IF((C895=E895),\"X\",\"\")))","v":""},null,null,{"$f":"IF(NOT(C895=E895),\"X\",\"\")","v":""},null,null,{"$f":"L894","v":"--"}]
["Largura da Caixa da Via:",null,null,null,null,{"$f":"IF(ISBLANK(C896),\"\",(IF((C896<=E896),\"X\",\"\")))","v":""},null,null,{"$f":"IF(ISBLANK(C896),\"\",(IF((C896>E896),\"X\",\"\")))","v":""},null,null,{"$f":"L895","v":"--"}]
["Largura da Pista ",null,null,null,null,"",null,null,"",null,null,"--"]
["Largura da calçada",null,null,null,null,"",null,null,"",null,null,"--"]
["Largura do passeio",null,null,null,null,"",null,null,"",null,null,"--"]
["Ciclovia",null,null,null,null,{"$f":"IF(ISBLANK(C900),\"\",(IF((C900<=E900),\"X\",\"\")))","v":""},null,null,"",null,null,"--"]
["Ciclofaixa",null,null,null,null,{"$f":"IF(ISBLANK(C901),\"\",(IF((C901<=E901),\"X\",\"\")))","v":""},null,null,"",null,null,"--"]
[null,null,null,null,null,null,null,null,null,null,null,{"$f":"L901","v":"--"}]
["R13",{"$f":"IF(ISTEXT(VLOOKUP(A903,'FICHA DE PROJETO'!$A$33:$I$213,2,FALSE)),VLOOKUP(A903,'FICHA DE PROJETO'!$A$33:$I$213,2,FALSE),\"\")","v":""},null,null,null,null,null,null,null,null,null,{"$f":"IF((B903=\"\"),\"--\",\"X\")","v":"--"}]
[null,null,"LEI",null,"PROJETO","ATENDEU À LEGISLAÇÃO",null,null,"NÃO ATENDEU À LEGISLAÇÃO",null,null,{"$f":"L903","v":"--"}]
["Caracterização da Via: ",null,null,null,null,{"$f":"IF(ISBLANK(C905),\"\",(IF((C905=E905),\"X\",\"\")))","v":""},null,null,{"$f":"IF(NOT(C905=E905),\"X\",\"\")","v":""},null,null,{"$f":"L904","v":"--"}]
["Largura da Caixa da Via:",null,null,null,null,{"$f":"IF(ISBLANK(C906),\"\",(IF((C906<=E906),\"X\",\"\")))","v":""},null,null,{"$f":"IF(ISBLANK(C906),\"\",(IF((C906>E906),\"X\",\"\")))","v":""},null,null,{"$f":"L905","v":"--"}]
["Largura da Pista ",null,null,null,null,"",null,null,"",null,null,"--"]
["Largura da calçada",null,null,null,null,"",null,null,"",null,null,"--"]
["Largura do passeio",null,null,null,null,"",null,null,"",null,null,"--"]
["Ciclovia",null,null,null,null,{"$f":"IF(ISBLANK(C910),\"\",(IF((C910<=E910),\"X\",\"\")))","v":""},null,null,"",null,null,"--"]
["Ciclofaixa",null,null,null,null,{"$f":"IF(ISBLANK(C911),\"\",(IF((C911<=E911),\"X\",\"\")))","v":""},null,null,"",null,null,"--"]
[null,null,null,null,null,null,null,null,null,null,null,{"$f":"L911","v":"--"}]
["R14",{"$f":"IF(ISTEXT(VLOOKUP(A913,'FICHA DE PROJETO'!$A$33:$I$213,2,FALSE)),VLOOKUP(A913,'FICHA DE PROJETO'!$A$33:$I$213,2,FALSE),\"\")","v":""},null,null,null,null,null,null,null,null,null,{"$f":"IF((B913=\"\"),\"--\",\"X\")","v":"--"}]
[null,null,"LEI",null,"PROJETO","ATENDEU À LEGISLAÇÃO",null,null,"NÃO ATENDEU À LEGISLAÇÃO",null,null,{"$f":"L913","v":"--"}]
["Caracterização da Via: ",null,null,null,null,{"$f":"IF(ISBLANK(C915),\"\",(IF((C915=E915),\"X\",\"\")))","v":""},null,null,{"$f":"IF(NOT(C915=E915),\"X\",\"\")","v":""},null,null,{"$f":"L914","v":"--"}]
["Largura da Caixa da Via:",null,null,null,null,{"$f":"IF(ISBLANK(C916),\"\",(IF((C916<=E916),\"X\",\"\")))","v":""},null,null,{"$f":"IF(ISBLANK(C916),\"\",(IF((C916>E916),\"X\",\"\")))","v":""},null,null,{"$f":"L915","v":"--"}]
["Largura da Pista ",null,null,null,null,"",null,null,"",null,null,"--"]
["Largura da calçada",null,null,null,null,"",null,null,"",null,null,"--"]
["Largura do passeio",null,null,null,null,"",null,null,"",null,null,"--"]
["Ciclovia",null,null,null,null,{"$f":"IF(ISBLANK(C920),\"\",(IF((C920<=E920),\"X\",\"\")))","v":""},null,null,"",null,null,"--"]
["Ciclofaixa",null,null,null,null,{"$f":"IF(ISBLANK(C921),\"\",(IF((C921<=E921),\"X\",\"\")))","v":""},null,null,"",null,null,"--"]
[null,null,null,null,null,null,null,null,null,null,null,{"$f":"L921","v":"--"}]
["R15",{"$f":"IF(ISTEXT(VLOOKUP(A923,'FICHA DE PROJETO'!$A$33:$I$213,2,FALSE)),VLOOKUP(A923,'FICHA DE PROJETO'!$A$33:$I$213,2,FALSE),\"\")","v":""},null,null,null,null,null,null,null,null,null,{"$f":"IF((B923=\"\"),\"--\",\"X\")","v":"--"}]
[null,null,"LEI",null,"PROJETO","ATENDEU À LEGISLAÇÃO",null,null,"NÃO ATENDEU À LEGISLAÇÃO",null,null,{"$f":"L923","v":"--"}]
["Caracterização da Via: ",null,null,null,null,{"$f":"IF(ISBLANK(C925),\"\",(IF((C925=E925),\"X\",\"\")))","v":""},null,null,{"$f":"IF(NOT(C925=E925),\"X\",\"\")","v":""},null,null,{"$f":"L924","v":"--"}]
["Largura da Caixa da Via:",null,null,null,null,{"$f":"IF(ISBLANK(C926),\"\",(IF((C926<=E926),\"X\",\"\")))","v":""},null,null,{"$f":"IF(ISBLANK(C926),\"\",(IF((C926>E926),\"X\",\"\")))","v":""},null,null,{"$f":"L925","v":"--"}]
["Largura da Pista ",null,null,null,null,"",null,null,"",null,null,"--"]
["Largura da calçada",null,null,null,null,"",null,null,"",null,null,"--"]
["Largura do passeio",null,null,null,null,"",null,null,"",null,null,"--"]
["Ciclovia",null,null,null,null,{"$f":"IF(ISBLANK(C930),\"\",(IF((C930<=E930),\"X\",\"\")))","v":""},null,null,"",null,null,"--"]
["Ciclofaixa",null,null,null,null,{"$f":"IF(ISBLANK(C931),\"\",(IF((C931<=E931),\"X\",\"\")))","v":""},null,null,"",null,null,"--"]
[null,null,null,null,null,null,null,null,null,null,null,{"$f":"L931","v":"--"}]
["R16",{"$f":"IF(ISTEXT(VLOOKUP(A933,'FICHA DE PROJETO'!$A$33:$I$213,2,FALSE)),VLOOKUP(A933,'FICHA DE PROJETO'!$A$33:$I$213,2,FALSE),\"\")","v":""},null,null,null,null,null,null,null,null,null,{"$f":"IF((B933=\"\"),\"--\",\"X\")","v":"--"}]
[null,null,"LEI",null,"PROJETO","ATENDEU À LEGISLAÇÃO",null,null,"NÃO ATENDEU À LEGISLAÇÃO",null,null,{"$f":"L933","v":"--"}]
["Caracterização da Via: ",null,null,null,null,{"$f":"IF(ISBLANK(C935),\"\",(IF((C935=E935),\"X\",\"\")))","v":""},null,null,{"$f":"IF(NOT(C935=E935),\"X\",\"\")","v":""},null,null,{"$f":"L934","v":"--"}]
["Largura da Caixa da Via:",null,null,null,null,{"$f":"IF(ISBLANK(C936),\"\",(IF((C936<=E936),\"X\",\"\")))","v":""},null,null,{"$f":"IF(ISBLANK(C936),\"\",(IF((C936>E936),\"X\",\"\")))","v":""},null,null,{"$f":"L935","v":"--"}]
["Largura da Pista ",null,null,null,null,"",null,null,"",null,null,"--"]
["Largura da calçada",null,null,null,null,"",null,null,"",null,null,"--"]
["Largura do passeio",null,null,null,null,"",null,null,"",null,null,"--"]
["Ciclovia",null,null,null,null,{"$f":"IF(ISBLANK(C940),\"\",(IF((C940<=E940),\"X\",\"\")))","v":""},null,null,"",null,null,"--"]
["Ciclofaixa",null,null,null,null,{"$f":"IF(ISBLANK(C941),\"\",(IF((C941<=E941),\"X\",\"\")))","v":""},null,null,"",null,null,"--"]
[null,null,null,null,null,null,null,null,null,null,null,{"$f":"L941","v":"--"}]
["R17",{"$f":"IF(ISTEXT(VLOOKUP(A943,'FICHA DE PROJETO'!$A$33:$I$213,2,FALSE)),VLOOKUP(A943,'FICHA DE PROJETO'!$A$33:$I$213,2,FALSE),\"\")","v":""},null,null,null,null,null,null,null,null,null,{"$f":"IF((B943=\"\"),\"--\",\"X\")","v":"--"}]
[null,null,"LEI",null,"PROJETO","ATENDEU À LEGISLAÇÃO",null,null,"NÃO ATENDEU À LEGISLAÇÃO",null,null,{"$f":"L943","v":"--"}]
["Caracterização da Via: ",null,null,null,null,{"$f":"IF(ISBLANK(C945),\"\",(IF((C945=E945),\"X\",\"\")))","v":""},null,null,{"$f":"IF(NOT(C945=E945),\"X\",\"\")","v":""},null,null,{"$f":"L944","v":"--"}]
["Largura da Caixa da Via:",null,null,null,null,{"$f":"IF(ISBLANK(C946),\"\",(IF((C946<=E946),\"X\",\"\")))","v":""},null,null,{"$f":"IF(ISBLANK(C946),\"\",(IF((C946>E946),\"X\",\"\")))","v":""},null,null,{"$f":"L945","v":"--"}]
["Largura da Pista ",null,null,null,null,"",null,null,"",null,null,"--"]
["Largura da calçada",null,null,null,null,"",null,null,"",null,null,"--"]
["Largura do passeio",null,null,null,null,"",null,null,"",null,null,"--"]
["Ciclovia",null,null,null,null,{"$f":"IF(ISBLANK(C950),\"\",(IF((C950<=E950),\"X\",\"\")))","v":""},null,null,"",null,null,"--"]
["Ciclofaixa",null,null,null,null,{"$f":"IF(ISBLANK(C951),\"\",(IF((C951<=E951),\"X\",\"\")))","v":""},null,null,"",null,null,"--"]
[null,null,null,null,null,null,null,null,null,null,null,{"$f":"L951","v":"--"}]
["R18",{"$f":"IF(ISTEXT(VLOOKUP(A953,'FICHA DE PROJETO'!$A$33:$I$213,2,FALSE)),VLOOKUP(A953,'FICHA DE PROJETO'!$A$33:$I$213,2,FALSE),\"\")","v":""},null,null,null,null,null,null,null,null,null,{"$f":"IF((B953=\"\"),\"--\",\"X\")","v":"--"}]
[null,null,"LEI",null,"PROJETO","ATENDEU À LEGISLAÇÃO",null,null,"NÃO ATENDEU À LEGISLAÇÃO",null,null,{"$f":"L953","v":"--"}]
["Caracterização da Via: ",null,null,null,null,{"$f":"IF(ISBLANK(C955),\"\",(IF((C955=E955),\"X\",\"\")))","v":""},null,null,{"$f":"IF(NOT(C955=E955),\"X\",\"\")","v":""},null,null,{"$f":"L954","v":"--"}]
["Largura da Caixa da Via:",null,null,null,null,{"$f":"IF(ISBLANK(C956),\"\",(IF((C956<=E956),\"X\",\"\")))","v":""},null,null,{"$f":"IF(ISBLANK(C956),\"\",(IF((C956>E956),\"X\",\"\")))","v":""},null,null,{"$f":"L955","v":"--"}]
["Largura da Pista ",null,null,null,null,"",null,null,"",null,null,"--"]
["Largura da calçada",null,null,null,null,"",null,null,"",null,null,"--"]
["Largura do passeio",null,null,null,null,"",null,null,"",null,null,"--"]
["Ciclovia",null,null,null,null,{"$f":"IF(ISBLANK(C960),\"\",(IF((C960<=E960),\"X\",\"\")))","v":""},null,null,"",null,null,"--"]
["Ciclofaixa",null,null,null,null,{"$f":"IF(ISBLANK(C961),\"\",(IF((C961<=E961),\"X\",\"\")))","v":""},null,null,"",null,null,"--"]
[null,null,null,null,null,null,null,null,null,null,null,{"$f":"L961","v":"--"}]
["R19",{"$f":"IF(ISTEXT(VLOOKUP(A963,'FICHA DE PROJETO'!$A$33:$I$213,2,FALSE)),VLOOKUP(A963,'FICHA DE PROJETO'!$A$33:$I$213,2,FALSE),\"\")","v":""},null,null,null,null,null,null,null,null,null,{"$f":"IF((B963=\"\"),\"--\",\"X\")","v":"--"}]
[null,null,"LEI",null,"PROJETO","ATENDEU À LEGISLAÇÃO",null,null,"NÃO ATENDEU À LEGISLAÇÃO",null,null,{"$f":"L963","v":"--"}]
["Caracterização da Via: ",null,null,null,null,{"$f":"IF(ISBLANK(C965),\"\",(IF((C965=E965),\"X\",\"\")))","v":""},null,null,{"$f":"IF(NOT(C965=E965),\"X\",\"\")","v":""},null,null,{"$f":"L964","v":"--"}]
["Largura da Caixa da Via:",null,null,null,null,{"$f":"IF(ISBLANK(C966),\"\",(IF((C966<=E966),\"X\",\"\")))","v":""},null,null,{"$f":"IF(ISBLANK(C966),\"\",(IF((C966>E966),\"X\",\"\")))","v":""},null,null,{"$f":"L965","v":"--"}]
["Largura da Pista ",null,null,null,null,"",null,null,"",null,null,"--"]
["Largura da calçada",null,null,null,null,"",null,null,"",null,null,"--"]
["Largura do passeio",null,null,null,null,"",null,null,"",null,null,"--"]
["Ciclovia",null,null,null,null,{"$f":"IF(ISBLANK(C970),\"\",(IF((C970<=E970),\"X\",\"\")))","v":""},null,null,"",null,null,"--"]
["Ciclofaixa",null,null,null,null,{"$f":"IF(ISBLANK(C971),\"\",(IF((C971<=E971),\"X\",\"\")))","v":""},null,null,"",null,null,"--"]
[null,null,null,null,null,null,null,null,null,null,null,{"$f":"L971","v":"--"}]
["R20",{"$f":"IF(ISTEXT(VLOOKUP(A973,'FICHA DE PROJETO'!$A$33:$I$213,2,FALSE)),VLOOKUP(A973,'FICHA DE PROJETO'!$A$33:$I$213,2,FALSE),\"\")","v":""},null,null,null,null,null,null,null,null,null,{"$f":"IF((B973=\"\"),\"--\",\"X\")","v":"--"}]
[null,null,"LEI",null,"PROJETO","ATENDEU À LEGISLAÇÃO",null,null,"NÃO ATENDEU À LEGISLAÇÃO",null,null,{"$f":"L973","v":"--"}]
["Caracterização da Via: ",null,null,null,null,{"$f":"IF(ISBLANK(C975),\"\",(IF((C975=E975),\"X\",\"\")))","v":""},null,null,{"$f":"IF(NOT(C975=E975),\"X\",\"\")","v":""},null,null,{"$f":"L974","v":"--"}]
["Largura da Caixa da Via:",null,null,null,null,{"$f":"IF(ISBLANK(C976),\"\",(IF((C976<=E976),\"X\",\"\")))","v":""},null,null,{"$f":"IF(ISBLANK(C976),\"\",(IF((C976>E976),\"X\",\"\")))","v":""},null,null,{"$f":"L975","v":"--"}]
["Largura da Pista ",null,null,null,null,"",null,null,"",null,null,"--"]
["Largura da calçada",null,null,null,null,"",null,null,"",null,null,"--"]
["Largura do passeio",null,null,null,null,"",null,null,"",null,null,"--"]
["Ciclovia",null,null,null,null,{"$f":"IF(ISBLANK(C980),\"\",(IF((C980<=E980),\"X\",\"\")))","v":""},null,null,"",null,null,"--"]
["Ciclofaixa",null,null,null,null,{"$f":"IF(ISBLANK(C981),\"\",(IF((C981<=E981),\"X\",\"\")))","v":""},null,null,"",null,null,"--"]
[null,null,null,null,null,null,null,null,null,null,null,{"$f":"L981","v":"--"}]
["R21",{"$f":"IF(ISTEXT(VLOOKUP(A983,'FICHA DE PROJETO'!$A$33:$I$213,2,FALSE)),VLOOKUP(A983,'FICHA DE PROJETO'!$A$33:$I$213,2,FALSE),\"\")","v":""},null,null,null,null,null,null,null,null,null,{"$f":"IF((B983=\"\"),\"--\",\"X\")","v":"--"}]
[null,null,"LEI",null,"PROJETO","ATENDEU À LEGISLAÇÃO",null,null,"NÃO ATENDEU À LEGISLAÇÃO",null,null,{"$f":"L983","v":"--"}]
["Caracterização da Via: ",null,null,null,null,{"$f":"IF(ISBLANK(C985),\"\",(IF((C985=E985),\"X\",\"\")))","v":""},null,null,{"$f":"IF(NOT(C985=E985),\"X\",\"\")","v":""},null,null,{"$f":"L984","v":"--"}]
["Largura da Caixa da Via:",null,null,null,null,{"$f":"IF(ISBLANK(C986),\"\",(IF((C986<=E986),\"X\",\"\")))","v":""},null,null,{"$f":"IF(ISBLANK(C986),\"\",(IF((C986>E986),\"X\",\"\")))","v":""},null,null,{"$f":"L985","v":"--"}]
["Largura da Pista ",null,null,null,null,"",null,null,"",null,null,"--"]
["Largura da calçada",null,null,null,null,"",null,null,"",null,null,"--"]
["Largura do passeio",null,null,null,null,"",null,null,"",null,null,"--"]
["Ciclovia",null,null,null,null,{"$f":"IF(ISBLANK(C990),\"\",(IF((C990<=E990),\"X\",\"\")))","v":""},null,null,"",null,null,"--"]
["Ciclofaixa",null,null,null,null,{"$f":"IF(ISBLANK(C991),\"\",(IF((C991<=E991),\"X\",\"\")))","v":""},null,null,"",null,null,"--"]
[null,null,null,null,null,null,null,null,null,null,null,{"$f":"L991","v":"--"}]
["R22",{"$f":"IF(ISTEXT(VLOOKUP(A993,'FICHA DE PROJETO'!$A$33:$I$213,2,FALSE)),VLOOKUP(A993,'FICHA DE PROJETO'!$A$33:$I$213,2,FALSE),\"\")","v":""},null,null,null,null,null,null,null,null,null,{"$f":"IF((B993=\"\"),\"--\",\"X\")","v":"--"}]
[null,null,"LEI",null,"PROJETO","ATENDEU À LEGISLAÇÃO",null,null,"NÃO ATENDEU À LEGISLAÇÃO",null,null,{"$f":"L993","v":"--"}]
["Caracterização da Via: ",null,null,null,null,{"$f":"IF(ISBLANK(C995),\"\",(IF((C995=E995),\"X\",\"\")))","v":""},null,null,{"$f":"IF(NOT(C995=E995),\"X\",\"\")","v":""},null,null,{"$f":"L994","v":"--"}]
["Largura da Caixa da Via:",null,null,null,null,{"$f":"IF(ISBLANK(C996),\"\",(IF((C996<=E996),\"X\",\"\")))","v":""},null,null,{"$f":"IF(ISBLANK(C996),\"\",(IF((C996>E996),\"X\",\"\")))","v":""},null,null,{"$f":"L995","v":"--"}]
["Largura da Pista ",null,null,null,null,"",null,null,"",null,null,"--"]
["Largura da calçada",null,null,null,null,"",null,null,"",null,null,"--"]
["Largura do passeio",null,null,null,null,"",null,null,"",null,null,"--"]
["Ciclovia",null,null,null,null,{"$f":"IF(ISBLANK(C1000),\"\",(IF((C1000<=E1000),\"X\",\"\")))","v":""},null,null,"",null,null,"--"]
["Ciclofaixa",null,null,null,null,{"$f":"IF(ISBLANK(C1001),\"\",(IF((C1001<=E1001),\"X\",\"\")))","v":""},null,null,"",null,null,"--"]
[null,null,null,null,null,null,null,null,null,null,null,{"$f":"L1001","v":"--"}]
["R23",{"$f":"IF(ISTEXT(VLOOKUP(A1003,'FICHA DE PROJETO'!$A$33:$I$213,2,FALSE)),VLOOKUP(A1003,'FICHA DE PROJETO'!$A$33:$I$213,2,FALSE),\"\")","v":""},null,null,null,null,null,null,null,null,null,{"$f":"IF((B1003=\"\"),\"--\",\"X\")","v":"--"}]
[null,null,"LEI",null,"PROJETO","ATENDEU À LEGISLAÇÃO",null,null,"NÃO ATENDEU À LEGISLAÇÃO",null,null,{"$f":"L1003","v":"--"}]
["Caracterização da Via: ",null,null,null,null,{"$f":"IF(ISBLANK(C1005),\"\",(IF((C1005=E1005),\"X\",\"\")))","v":""},null,null,{"$f":"IF(NOT(C1005=E1005),\"X\",\"\")","v":""},null,null,{"$f":"L1004","v":"--"}]
["Largura da Caixa da Via:",null,null,null,null,{"$f":"IF(ISBLANK(C1006),\"\",(IF((C1006<=E1006),\"X\",\"\")))","v":""},null,null,{"$f":"IF(ISBLANK(C1006),\"\",(IF((C1006>E1006),\"X\",\"\")))","v":""},null,null,{"$f":"L1005","v":"--"}]
["Largura da Pista ",null,null,null,null,"",null,null,"",null,null,"--"]
["Largura da calçada",null,null,null,null,"",null,null,"",null,null,"--"]
["Largura do passeio",null,null,null,null,"",null,null,"",null,null,"--"]
["Ciclovia",null,null,null,null,{"$f":"IF(ISBLANK(C1010),\"\",(IF((C1010<=E1010),\"X\",\"\")))","v":""},null,null,"",null,null,"--"]
["Ciclofaixa",null,null,null,null,{"$f":"IF(ISBLANK(C1011),\"\",(IF((C1011<=E1011),\"X\",\"\")))","v":""},null,null,"",null,null,"--"]
[null,null,null,null,null,null,null,null,null,null,null,{"$f":"L1011","v":"--"}]
["R24",{"$f":"IF(ISTEXT(VLOOKUP(A1013,'FICHA DE PROJETO'!$A$33:$I$213,2,FALSE)),VLOOKUP(A1013,'FICHA DE PROJETO'!$A$33:$I$213,2,FALSE),\"\")","v":""},null,null,null,null,null,null,null,null,null,{"$f":"IF((B1013=\"\"),\"--\",\"X\")","v":"--"}]
[null,null,"LEI",null,"PROJETO","ATENDEU À LEGISLAÇÃO",null,null,"NÃO ATENDEU À LEGISLAÇÃO",null,null,{"$f":"L1013","v":"--"}]
["Caracterização da Via: ",null,null,null,null,{"$f":"IF(ISBLANK(C1015),\"\",(IF((C1015=E1015),\"X\",\"\")))","v":""},null,null,{"$f":"IF(NOT(C1015=E1015),\"X\",\"\")","v":""},null,null,{"$f":"L1014","v":"--"}]
["Largura da Caixa da Via:",null,null,null,null,{"$f":"IF(ISBLANK(C1016),\"\",(IF((C1016<=E1016),\"X\",\"\")))","v":""},null,null,{"$f":"IF(ISBLANK(C1016),\"\",(IF((C1016>E1016),\"X\",\"\")))","v":""},null,null,{"$f":"L1015","v":"--"}]
["Largura da Pista ",null,null,null,null,"",null,null,"",null,null,"--"]
["Largura da calçada",null,null,null,null,"",null,null,"",null,null,"--"]
["Largura do passeio",null,null,null,null,"",null,null,"",null,null,"--"]
["Ciclovia",null,null,null,null,{"$f":"IF(ISBLANK(C1020),\"\",(IF((C1020<=E1020),\"X\",\"\")))","v":""},null,null,"",null,null,"--"]
["Ciclofaixa",null,null,null,null,{"$f":"IF(ISBLANK(C1021),\"\",(IF((C1021<=E1021),\"X\",\"\")))","v":""},null,null,"",null,null,"--"]
[null,null,null,null,null,null,null,null,null,null,null,{"$f":"L1021","v":"--"}]
["R25",{"$f":"IF(ISTEXT(VLOOKUP(A1023,'FICHA DE PROJETO'!$A$33:$I$213,2,FALSE)),VLOOKUP(A1023,'FICHA DE PROJETO'!$A$33:$I$213,2,FALSE),\"\")","v":""},null,null,null,null,null,null,null,null,null,{"$f":"IF((B1023=\"\"),\"--\",\"X\")","v":"--"}]
[null,null,"LEI",null,"PROJETO","ATENDEU À LEGISLAÇÃO",null,null,"NÃO ATENDEU À LEGISLAÇÃO",null,null,{"$f":"L1023","v":"--"}]
["Caracterização da Via: ",null,null,null,null,{"$f":"IF(ISBLANK(C1025),\"\",(IF((C1025=E1025),\"X\",\"\")))","v":""},null,null,{"$f":"IF(NOT(C1025=E1025),\"X\",\"\")","v":""},null,null,{"$f":"L1024","v":"--"}]
["Largura da Caixa da Via:",null,null,null,null,{"$f":"IF(ISBLANK(C1026),\"\",(IF((C1026<=E1026),\"X\",\"\")))","v":""},null,null,{"$f":"IF(ISBLANK(C1026),\"\",(IF((C1026>E1026),\"X\",\"\")))","v":""},null,null,{"$f":"L1025","v":"--"}]
["Largura da Pista ",null,null,null,null,"",null,null,"",null,null,"--"]
["Largura da calçada",null,null,null,null,"",null,null,"",null,null,"--"]
["Largura do passeio",null,null,null,null,"",null,null,"",null,null,"--"]
["Ciclovia",null,null,null,null,{"$f":"IF(ISBLANK(C1030),\"\",(IF((C1030<=E1030),\"X\",\"\")))","v":""},null,null,"",null,null,"--"]
["Ciclofaixa",null,null,null,null,{"$f":"IF(ISBLANK(C1031),\"\",(IF((C1031<=E1031),\"X\",\"\")))","v":""},null,null,"",null,null,"--"]
[null,null,null,null,null,null,null,null,null,null,null,{"$f":"L1031","v":"--"}]
["R26",{"$f":"IF(ISTEXT(VLOOKUP(A1033,'FICHA DE PROJETO'!$A$33:$I$213,2,FALSE)),VLOOKUP(A1033,'FICHA DE PROJETO'!$A$33:$I$213,2,FALSE),\"\")","v":""},null,null,null,null,null,null,null,null,null,{"$f":"IF((B1033=\"\"),\"--\",\"X\")","v":"--"}]
[null,null,"LEI",null,"PROJETO","ATENDEU À LEGISLAÇÃO",null,null,"NÃO ATENDEU À LEGISLAÇÃO",null,null,{"$f":"L1033","v":"--"}]
["Caracterização da Via: ",null,null,null,null,{"$f":"IF(ISBLANK(C1035),\"\",(IF((C1035=E1035),\"X\",\"\")))","v":""},null,null,{"$f":"IF(NOT(C1035=E1035),\"X\",\"\")","v":""},null,null,{"$f":"L1034","v":"--"}]
["Largura da Caixa da Via:",null,null,null,null,{"$f":"IF(ISBLANK(C1036),\"\",(IF((C1036<=E1036),\"X\",\"\")))","v":""},null,null,{"$f":"IF(ISBLANK(C1036),\"\",(IF((C1036>E1036),\"X\",\"\")))","v":""},null,null,{"$f":"L1035","v":"--"}]
["Largura da Pista ",null,null,null,null,"",null,null,"",null,null,"--"]
["Largura da calçada",null,null,null,null,"",null,null,"",null,null,"--"]
["Largura do passeio",null,null,null,null,"",null,null,"",null,null,"--"]
["Ciclovia",null,null,null,null,{"$f":"IF(ISBLANK(C1040),\"\",(IF((C1040<=E1040),\"X\",\"\")))","v":""},null,null,"",null,null,"--"]
["Ciclofaixa",null,null,null,null,{"$f":"IF(ISBLANK(C1041),\"\",(IF((C1041<=E1041),\"X\",\"\")))","v":""},null,null,"",null,null,"--"]
[null,null,null,null,null,null,null,null,null,null,null,{"$f":"L1041","v":"--"}]
["R27",{"$f":"IF(ISTEXT(VLOOKUP(A1043,'FICHA DE PROJETO'!$A$33:$I$213,2,FALSE)),VLOOKUP(A1043,'FICHA DE PROJETO'!$A$33:$I$213,2,FALSE),\"\")","v":""},null,null,null,null,null,null,null,null,null,{"$f":"IF((B1043=\"\"),\"--\",\"X\")","v":"--"}]
[null,null,"LEI",null,"PROJETO","ATENDEU À LEGISLAÇÃO",null,null,"NÃO ATENDEU À LEGISLAÇÃO",null,null,{"$f":"L1043","v":"--"}]
["Caracterização da Via: ",null,null,null,null,{"$f":"IF(ISBLANK(C1045),\"\",(IF((C1045=E1045),\"X\",\"\")))","v":""},null,null,{"$f":"IF(NOT(C1045=E1045),\"X\",\"\")","v":""},null,null,{"$f":"L1044","v":"--"}]
["Largura da Caixa da Via:",null,null,null,null,{"$f":"IF(ISBLANK(C1046),\"\",(IF((C1046<=E1046),\"X\",\"\")))","v":""},null,null,{"$f":"IF(ISBLANK(C1046),\"\",(IF((C1046>E1046),\"X\",\"\")))","v":""},null,null,{"$f":"L1045","v":"--"}]
["Largura da Pista ",null,null,null,null,"",null,null,"",null,null,"--"]
["Largura da calçada",null,null,null,null,"",null,null,"",null,null,"--"]
["Largura do passeio",null,null,null,null,"",null,null,"",null,null,"--"]
["Ciclovia",null,null,null,null,{"$f":"IF(ISBLANK(C1050),\"\",(IF((C1050<=E1050),\"X\",\"\")))","v":""},null,null,"",null,null,"--"]
["Ciclofaixa",null,null,null,null,{"$f":"IF(ISBLANK(C1051),\"\",(IF((C1051<=E1051),\"X\",\"\")))","v":""},null,null,"",null,null,"--"]
[null,null,null,null,null,null,null,null,null,null,null,{"$f":"L1051","v":"--"}]
["R28",{"$f":"IF(ISTEXT(VLOOKUP(A1053,'FICHA DE PROJETO'!$A$33:$I$213,2,FALSE)),VLOOKUP(A1053,'FICHA DE PROJETO'!$A$33:$I$213,2,FALSE),\"\")","v":""},null,null,null,null,null,null,null,null,null,{"$f":"IF((B1053=\"\"),\"--\",\"X\")","v":"--"}]
[null,null,"LEI",null,"PROJETO","ATENDEU À LEGISLAÇÃO",null,null,"NÃO ATENDEU À LEGISLAÇÃO",null,null,{"$f":"L1053","v":"--"}]
["Caracterização da Via: ",null,null,null,null,{"$f":"IF(ISBLANK(C1055),\"\",(IF((C1055=E1055),\"X\",\"\")))","v":""},null,null,{"$f":"IF(NOT(C1055=E1055),\"X\",\"\")","v":""},null,null,{"$f":"L1054","v":"--"}]
["Largura da Caixa da Via:",null,null,null,null,{"$f":"IF(ISBLANK(C1056),\"\",(IF((C1056<=E1056),\"X\",\"\")))","v":""},null,null,{"$f":"IF(ISBLANK(C1056),\"\",(IF((C1056>E1056),\"X\",\"\")))","v":""},null,null,{"$f":"L1055","v":"--"}]
["Largura da Pista ",null,null,null,null,"",null,null,"",null,null,"--"]
["Largura da calçada",null,null,null,null,"",null,null,"",null,null,"--"]
["Largura do passeio",null,null,null,null,"",null,null,"",null,null,"--"]
["Ciclovia",null,null,null,null,{"$f":"IF(ISBLANK(C1060),\"\",(IF((C1060<=E1060),\"X\",\"\")))","v":""},null,null,"",null,null,"--"]
["Ciclofaixa",null,null,null,null,{"$f":"IF(ISBLANK(C1061),\"\",(IF((C1061<=E1061),\"X\",\"\")))","v":""},null,null,"",null,null,"--"]
[null,null,null,null,null,null,null,null,null,null,null,{"$f":"L1061","v":"--"}]
["R29",{"$f":"IF(ISTEXT(VLOOKUP(A1063,'FICHA DE PROJETO'!$A$33:$I$213,2,FALSE)),VLOOKUP(A1063,'FICHA DE PROJETO'!$A$33:$I$213,2,FALSE),\"\")","v":""},null,null,null,null,null,null,null,null,null,{"$f":"IF((B1063=\"\"),\"--\",\"X\")","v":"--"}]
[null,null,"LEI",null,"PROJETO","ATENDEU À LEGISLAÇÃO",null,null,"NÃO ATENDEU À LEGISLAÇÃO",null,null,{"$f":"L1063","v":"--"}]
["Caracterização da Via: ",null,null,null,null,{"$f":"IF(ISBLANK(C1065),\"\",(IF((C1065=E1065),\"X\",\"\")))","v":""},null,null,{"$f":"IF(NOT(C1065=E1065),\"X\",\"\")","v":""},null,null,{"$f":"L1064","v":"--"}]
["Largura da Caixa da Via:",null,null,null,null,{"$f":"IF(ISBLANK(C1066),\"\",(IF((C1066<=E1066),\"X\",\"\")))","v":""},null,null,{"$f":"IF(ISBLANK(C1066),\"\",(IF((C1066>E1066),\"X\",\"\")))","v":""},null,null,{"$f":"L1065","v":"--"}]
["Largura da Pista ",null,null,null,null,"",null,null,"",null,null,"--"]
["Largura da calçada",null,null,null,null,"",null,null,"",null,null,"--"]
["Largura do passeio",null,null,null,null,"",null,null,"",null,null,"--"]
["Ciclovia",null,null,null,null,{"$f":"IF(ISBLANK(C1070),\"\",(IF((C1070<=E1070),\"X\",\"\")))","v":""},null,null,"",null,null,"--"]
["Ciclofaixa",null,null,null,null,{"$f":"IF(ISBLANK(C1071),\"\",(IF((C1071<=E1071),\"X\",\"\")))","v":""},null,null,"",null,null,"--"]
[null,null,null,null,null,null,null,null,null,null,null,{"$f":"L1071","v":"--"}]
["R30",{"$f":"IF(ISTEXT(VLOOKUP(A1073,'FICHA DE PROJETO'!$A$33:$I$213,2,FALSE)),VLOOKUP(A1073,'FICHA DE PROJETO'!$A$33:$I$213,2,FALSE),\"\")","v":""},null,null,null,null,null,null,null,null,null,{"$f":"IF((B1073=\"\"),\"--\",\"X\")","v":"--"}]
[null,null,"LEI",null,"PROJETO","ATENDEU À LEGISLAÇÃO",null,null,"NÃO ATENDEU À LEGISLAÇÃO",null,null,{"$f":"L1073","v":"--"}]
["Caracterização da Via: ",null,null,null,null,{"$f":"IF(ISBLANK(C1075),\"\",(IF((C1075=E1075),\"X\",\"\")))","v":""},null,null,{"$f":"IF(NOT(C1075=E1075),\"X\",\"\")","v":""},null,null,{"$f":"L1074","v":"--"}]
["Largura da Caixa da Via:",null,null,null,null,{"$f":"IF(ISBLANK(C1076),\"\",(IF((C1076<=E1076),\"X\",\"\")))","v":""},null,null,{"$f":"IF(ISBLANK(C1076),\"\",(IF((C1076>E1076),\"X\",\"\")))","v":""},null,null,{"$f":"L1075","v":"--"}]
["Largura da Pista ",null,null,null,null,"",null,null,"",null,null,"--"]
["Largura da calçada",null,null,null,null,"",null,null,"",null,null,"--"]
["Largura do passeio",null,null,null,null,"",null,null,"",null,null,"--"]
["Ciclovia",null,null,null,null,{"$f":"IF(ISBLANK(C1080),\"\",(IF((C1080<=E1080),\"X\",\"\")))","v":""},null,null,"",null,null,"--"]
["Ciclofaixa",null,null,null,null,{"$f":"IF(ISBLANK(C1081),\"\",(IF((C1081<=E1081),\"X\",\"\")))","v":""},null,null,"",null,null,"--"]
[null,null,null,null,null,null,null,null,null,null,null,{"$f":"L1081","v":"--"}]
["R31",{"$f":"IF(ISTEXT(VLOOKUP(A1083,'FICHA DE PROJETO'!$A$33:$I$213,2,FALSE)),VLOOKUP(A1083,'FICHA DE PROJETO'!$A$33:$I$213,2,FALSE),\"\")","v":""},null,null,null,null,null,null,null,null,null,{"$f":"IF((B1083=\"\"),\"--\",\"X\")","v":"--"}]
[null,null,"LEI",null,"PROJETO","ATENDEU À LEGISLAÇÃO",null,null,"NÃO ATENDEU À LEGISLAÇÃO",null,null,{"$f":"L1083","v":"--"}]
["Caracterização da Via: ",null,null,null,null,{"$f":"IF(ISBLANK(C1085),\"\",(IF((C1085=E1085),\"X\",\"\")))","v":""},null,null,{"$f":"IF(NOT(C1085=E1085),\"X\",\"\")","v":""},null,null,{"$f":"L1084","v":"--"}]
["Largura da Caixa da Via:",null,null,null,null,{"$f":"IF(ISBLANK(C1086),\"\",(IF((C1086<=E1086),\"X\",\"\")))","v":""},null,null,{"$f":"IF(ISBLANK(C1086),\"\",(IF((C1086>E1086),\"X\",\"\")))","v":""},null,null,{"$f":"L1085","v":"--"}]
["Largura da Pista ",null,null,null,null,"",null,null,"",null,null,"--"]
["Largura da calçada",null,null,null,null,"",null,null,"",null,null,"--"]
["Largura do passeio",null,null,null,null,"",null,null,"",null,null,"--"]
["Ciclovia",null,null,null,null,{"$f":"IF(ISBLANK(C1090),\"\",(IF((C1090<=E1090),\"X\",\"\")))","v":""},null,null,"",null,null,"--"]
["Ciclofaixa",null,null,null,null,{"$f":"IF(ISBLANK(C1091),\"\",(IF((C1091<=E1091),\"X\",\"\")))","v":""},null,null,"",null,null,"--"]
[null,null,null,null,null,null,null,null,null,null,null,{"$f":"L1091","v":"--"}]
["R32",{"$f":"IF(ISTEXT(VLOOKUP(A1093,'FICHA DE PROJETO'!$A$33:$I$213,2,FALSE)),VLOOKUP(A1093,'FICHA DE PROJETO'!$A$33:$I$213,2,FALSE),\"\")","v":""},null,null,null,null,null,null,null,null,null,{"$f":"IF((B1093=\"\"),\"--\",\"X\")","v":"--"}]
[null,null,"LEI",null,"PROJETO","ATENDEU À LEGISLAÇÃO",null,null,"NÃO ATENDEU À LEGISLAÇÃO",null,null,{"$f":"L1093","v":"--"}]
["Caracterização da Via: ",null,null,null,null,{"$f":"IF(ISBLANK(C1095),\"\",(IF((C1095=E1095),\"X\",\"\")))","v":""},null,null,{"$f":"IF(NOT(C1095=E1095),\"X\",\"\")","v":""},null,null,{"$f":"L1094","v":"--"}]
["Largura da Caixa da Via:",null,null,null,null,{"$f":"IF(ISBLANK(C1096),\"\",(IF((C1096<=E1096),\"X\",\"\")))","v":""},null,null,{"$f":"IF(ISBLANK(C1096),\"\",(IF((C1096>E1096),\"X\",\"\")))","v":""},null,null,{"$f":"L1095","v":"--"}]
["Largura da Pista ",null,null,null,null,"",null,null,"",null,null,"--"]
["Largura da calçada",null,null,null,null,"",null,null,"",null,null,"--"]
["Largura do passeio",null,null,null,null,"",null,null,"",null,null,"--"]
["Ciclovia",null,null,null,null,{"$f":"IF(ISBLANK(C1100),\"\",(IF((C1100<=E1100),\"X\",\"\")))","v":""},null,null,"",null,null,"--"]
["Ciclofaixa",null,null,null,null,{"$f":"IF(ISBLANK(C1101),\"\",(IF((C1101<=E1101),\"X\",\"\")))","v":""},null,null,"",null,null,"--"]
[null,null,null,null,null,null,null,null,null,null,null,{"$f":"L1101","v":"--"}]
["R33",{"$f":"IF(ISTEXT(VLOOKUP(A1103,'FICHA DE PROJETO'!$A$33:$I$213,2,FALSE)),VLOOKUP(A1103,'FICHA DE PROJETO'!$A$33:$I$213,2,FALSE),\"\")","v":""},null,null,null,null,null,null,null,null,null,{"$f":"IF((B1103=\"\"),\"--\",\"X\")","v":"--"}]
[null,null,"LEI",null,"PROJETO","ATENDEU À LEGISLAÇÃO",null,null,"NÃO ATENDEU À LEGISLAÇÃO",null,null,{"$f":"L1103","v":"--"}]
["Caracterização da Via: ",null,null,null,null,{"$f":"IF(ISBLANK(C1105),\"\",(IF((C1105=E1105),\"X\",\"\")))","v":""},null,null,{"$f":"IF(NOT(C1105=E1105),\"X\",\"\")","v":""},null,null,{"$f":"L1104","v":"--"}]
["Largura da Caixa da Via:",null,null,null,null,{"$f":"IF(ISBLANK(C1106),\"\",(IF((C1106<=E1106),\"X\",\"\")))","v":""},null,null,{"$f":"IF(ISBLANK(C1106),\"\",(IF((C1106>E1106),\"X\",\"\")))","v":""},null,null,{"$f":"L1105","v":"--"}]
["Largura da Pista ",null,null,null,null,"",null,null,"",null,null,"--"]
["Largura da calçada",null,null,null,null,"",null,null,"",null,null,"--"]
["Largura do passeio",null,null,null,null,"",null,null,"",null,null,"--"]
["Ciclovia",null,null,null,null,{"$f":"IF(ISBLANK(C1110),\"\",(IF((C1110<=E1110),\"X\",\"\")))","v":""},null,null,"",null,null,"--"]
["Ciclofaixa",null,null,null,null,{"$f":"IF(ISBLANK(C1111),\"\",(IF((C1111<=E1111),\"X\",\"\")))","v":""},null,null,"",null,null,"--"]
[null,null,null,null,null,null,null,null,null,null,null,{"$f":"L1111","v":"--"}]
["R34",{"$f":"IF(ISTEXT(VLOOKUP(A1113,'FICHA DE PROJETO'!$A$33:$I$213,2,FALSE)),VLOOKUP(A1113,'FICHA DE PROJETO'!$A$33:$I$213,2,FALSE),\"\")","v":""},null,null,null,null,null,null,null,null,null,{"$f":"IF((B1113=\"\"),\"--\",\"X\")","v":"--"}]
[null,null,"LEI",null,"PROJETO","ATENDEU À LEGISLAÇÃO",null,null,"NÃO ATENDEU À LEGISLAÇÃO",null,null,{"$f":"L1113","v":"--"}]
["Caracterização da Via: ",null,null,null,null,{"$f":"IF(ISBLANK(C1115),\"\",(IF((C1115=E1115),\"X\",\"\")))","v":""},null,null,{"$f":"IF(NOT(C1115=E1115),\"X\",\"\")","v":""},null,null,{"$f":"L1114","v":"--"}]
["Largura da Caixa da Via:",null,null,null,null,{"$f":"IF(ISBLANK(C1116),\"\",(IF((C1116<=E1116),\"X\",\"\")))","v":""},null,null,{"$f":"IF(ISBLANK(C1116),\"\",(IF((C1116>E1116),\"X\",\"\")))","v":""},null,null,{"$f":"L1115","v":"--"}]
["Largura da Pista ",null,null,null,null,"",null,null,"",null,null,"--"]
["Largura da calçada",null,null,null,null,"",null,null,"",null,null,"--"]
["Largura do passeio",null,null,null,null,"",null,null,"",null,null,"--"]
["Ciclovia",null,null,null,null,{"$f":"IF(ISBLANK(C1120),\"\",(IF((C1120<=E1120),\"X\",\"\")))","v":""},null,null,"",null,null,"--"]
["Ciclofaixa",null,null,null,null,{"$f":"IF(ISBLANK(C1121),\"\",(IF((C1121<=E1121),\"X\",\"\")))","v":""},null,null,"",null,null,"--"]
[null,null,null,null,null,null,null,null,null,null,null,{"$f":"L1121","v":"--"}]
["R35",{"$f":"IF(ISTEXT(VLOOKUP(A1123,'FICHA DE PROJETO'!$A$33:$I$213,2,FALSE)),VLOOKUP(A1123,'FICHA DE PROJETO'!$A$33:$I$213,2,FALSE),\"\")","v":""},null,null,null,null,null,null,null,null,null,{"$f":"IF((B1123=\"\"),\"--\",\"X\")","v":"--"}]
[null,null,"LEI",null,"PROJETO","ATENDEU À LEGISLAÇÃO",null,null,"NÃO ATENDEU À LEGISLAÇÃO",null,null,{"$f":"L1123","v":"--"}]
["Caracterização da Via: ",null,null,null,null,{"$f":"IF(ISBLANK(C1125),\"\",(IF((C1125=E1125),\"X\",\"\")))","v":""},null,null,{"$f":"IF(NOT(C1125=E1125),\"X\",\"\")","v":""},null,null,{"$f":"L1124","v":"--"}]
["Largura da Caixa da Via:",null,null,null,null,{"$f":"IF(ISBLANK(C1126),\"\",(IF((C1126<=E1126),\"X\",\"\")))","v":""},null,null,{"$f":"IF(ISBLANK(C1126),\"\",(IF((C1126>E1126),\"X\",\"\")))","v":""},null,null,{"$f":"L1125","v":"--"}]
["Largura da Pista ",null,null,null,null,"",null,null,"",null,null,"--"]
["Largura da calçada",null,null,null,null,"",null,null,"",null,null,"--"]
["Largura do passeio",null,null,null,null,"",null,null,"",null,null,"--"]
["Ciclovia",null,null,null,null,{"$f":"IF(ISBLANK(C1130),\"\",(IF((C1130<=E1130),\"X\",\"\")))","v":""},null,null,"",null,null,"--"]
["Ciclofaixa",null,null,null,null,{"$f":"IF(ISBLANK(C1131),\"\",(IF((C1131<=E1131),\"X\",\"\")))","v":""},null,null,"",null,null,"--"]
[null,null,null,null,null,null,null,null,null,null,null,{"$f":"L1131","v":"--"}]
["R36",{"$f":"IF(ISTEXT(VLOOKUP(A1133,'FICHA DE PROJETO'!$A$33:$I$213,2,FALSE)),VLOOKUP(A1133,'FICHA DE PROJETO'!$A$33:$I$213,2,FALSE),\"\")","v":""},null,null,null,null,null,null,null,null,null,{"$f":"IF((B1133=\"\"),\"--\",\"X\")","v":"--"}]
[null,null,"LEI",null,"PROJETO","ATENDEU À LEGISLAÇÃO",null,null,"NÃO ATENDEU À LEGISLAÇÃO",null,null,{"$f":"L1133","v":"--"}]
["Caracterização da Via: ",null,null,null,null,{"$f":"IF(ISBLANK(C1135),\"\",(IF((C1135=E1135),\"X\",\"\")))","v":""},null,null,{"$f":"IF(NOT(C1135=E1135),\"X\",\"\")","v":""},null,null,{"$f":"L1134","v":"--"}]
["Largura da Caixa da Via:",null,null,null,null,{"$f":"IF(ISBLANK(C1136),\"\",(IF((C1136<=E1136),\"X\",\"\")))","v":""},null,null,{"$f":"IF(ISBLANK(C1136),\"\",(IF((C1136>E1136),\"X\",\"\")))","v":""},null,null,{"$f":"L1135","v":"--"}]
["Largura da Pista ",null,null,null,null,"",null,null,"",null,null,"--"]
["Largura da calçada",null,null,null,null,"",null,null,"",null,null,"--"]
["Largura do passeio",null,null,null,null,"",null,null,"",null,null,"--"]
["Ciclovia",null,null,null,null,{"$f":"IF(ISBLANK(C1140),\"\",(IF((C1140<=E1140),\"X\",\"\")))","v":""},null,null,"",null,null,"--"]
["Ciclofaixa",null,null,null,null,{"$f":"IF(ISBLANK(C1141),\"\",(IF((C1141<=E1141),\"X\",\"\")))","v":""},null,null,"",null,null,"--"]
[null,null,null,null,null,null,null,null,null,null,null,{"$f":"L1141","v":"--"}]
["R37",{"$f":"IF(ISTEXT(VLOOKUP(A1143,'FICHA DE PROJETO'!$A$33:$I$213,2,FALSE)),VLOOKUP(A1143,'FICHA DE PROJETO'!$A$33:$I$213,2,FALSE),\"\")","v":""},null,null,null,null,null,null,null,null,null,{"$f":"IF((B1143=\"\"),\"--\",\"X\")","v":"--"}]
[null,null,"LEI",null,"PROJETO","ATENDEU À LEGISLAÇÃO",null,null,"NÃO ATENDEU À LEGISLAÇÃO",null,null,{"$f":"L1143","v":"--"}]
["Caracterização da Via: ",null,null,null,null,{"$f":"IF(ISBLANK(C1145),\"\",(IF((C1145=E1145),\"X\",\"\")))","v":""},null,null,{"$f":"IF(NOT(C1145=E1145),\"X\",\"\")","v":""},null,null,{"$f":"L1144","v":"--"}]
["Largura da Caixa da Via:",null,null,null,null,{"$f":"IF(ISBLANK(C1146),\"\",(IF((C1146<=E1146),\"X\",\"\")))","v":""},null,null,{"$f":"IF(ISBLANK(C1146),\"\",(IF((C1146>E1146),\"X\",\"\")))","v":""},null,null,{"$f":"L1145","v":"--"}]
["Largura da Pista ",null,null,null,null,"",null,null,"",null,null,"--"]
["Largura da calçada",null,null,null,null,"",null,null,"",null,null,"--"]
["Largura do passeio",null,null,null,null,"",null,null,"",null,null,"--"]
["Ciclovia",null,null,null,null,{"$f":"IF(ISBLANK(C1150),\"\",(IF((C1150<=E1150),\"X\",\"\")))","v":""},null,null,"",null,null,"--"]
["Ciclofaixa",null,null,null,null,{"$f":"IF(ISBLANK(C1151),\"\",(IF((C1151<=E1151),\"X\",\"\")))","v":""},null,null,"",null,null,"--"]
[null,null,null,null,null,null,null,null,null,null,null,{"$f":"L1151","v":"--"}]
["R38",{"$f":"IF(ISTEXT(VLOOKUP(A1153,'FICHA DE PROJETO'!$A$33:$I$213,2,FALSE)),VLOOKUP(A1153,'FICHA DE PROJETO'!$A$33:$I$213,2,FALSE),\"\")","v":""},null,null,null,null,null,null,null,null,null,{"$f":"IF((B1153=\"\"),\"--\",\"X\")","v":"--"}]
[null,null,"LEI",null,"PROJETO","ATENDEU À LEGISLAÇÃO",null,null,"NÃO ATENDEU À LEGISLAÇÃO",null,null,{"$f":"L1153","v":"--"}]
["Caracterização da Via: ",null,null,null,null,{"$f":"IF(ISBLANK(C1155),\"\",(IF((C1155=E1155),\"X\",\"\")))","v":""},null,null,{"$f":"IF(NOT(C1155=E1155),\"X\",\"\")","v":""},null,null,{"$f":"L1154","v":"--"}]
["Largura da Caixa da Via:",null,null,null,null,{"$f":"IF(ISBLANK(C1156),\"\",(IF((C1156<=E1156),\"X\",\"\")))","v":""},null,null,{"$f":"IF(ISBLANK(C1156),\"\",(IF((C1156>E1156),\"X\",\"\")))","v":""},null,null,{"$f":"L1155","v":"--"}]
["Largura da Pista ",null,null,null,null,"",null,null,"",null,null,"--"]
["Largura da calçada",null,null,null,null,"",null,null,"",null,null,"--"]
["Largura do passeio",null,null,null,null,"",null,null,"",null,null,"--"]
["Ciclovia",null,null,null,null,{"$f":"IF(ISBLANK(C1160),\"\",(IF((C1160<=E1160),\"X\",\"\")))","v":""},null,null,"",null,null,"--"]
["Ciclofaixa",null,null,null,null,{"$f":"IF(ISBLANK(C1161),\"\",(IF((C1161<=E1161),\"X\",\"\")))","v":""},null,null,"",null,null,"--"]
[null,null,null,null,null,null,null,null,null,null,null,{"$f":"L1161","v":"--"}]
["R98",{"$f":"IF(ISTEXT(VLOOKUP(A1163,'FICHA DE PROJETO'!$A$33:$I$213,2,FALSE)),VLOOKUP(A1163,'FICHA DE PROJETO'!$A$33:$I$213,2,FALSE),\"\")","v":""},null,null,null,null,null,null,null,null,null,{"$f":"IF((B1163=\"\"),\"--\",\"X\")","v":"--"}]
[null,null,"LEI",null,"PROJETO","ATENDEU À LEGISLAÇÃO",null,null,"NÃO ATENDEU À LEGISLAÇÃO",null,null,{"$f":"L1163","v":"--"}]
["Caracterização da Via: ",null,null,null,null,{"$f":"IF(ISBLANK(C1165),\"\",(IF((C1165=E1165),\"X\",\"\")))","v":""},null,null,{"$f":"IF(NOT(C1165=E1165),\"X\",\"\")","v":""},null,null,{"$f":"L1164","v":"--"}]
["Largura da Caixa da Via:",null,null,null,null,{"$f":"IF(ISBLANK(C1166),\"\",(IF((C1166<=E1166),\"X\",\"\")))","v":""},null,null,{"$f":"IF(ISBLANK(C1166),\"\",(IF((C1166>E1166),\"X\",\"\")))","v":""},null,null,{"$f":"L1165","v":"--"}]
["Largura da Pista ",null,null,null,null,"",null,null,"",null,null,"--"]
["Largura da calçada",null,null,null,null,"",null,null,"",null,null,"--"]
["Largura do passeio",null,null,null,null,"",null,null,"",null,null,"--"]
["Ciclovia",null,null,null,null,{"$f":"IF(ISBLANK(C1170),\"\",(IF((C1170<=E1170),\"X\",\"\")))","v":""},null,null,"",null,null,"--"]
["Ciclofaixa",null,null,null,null,{"$f":"IF(ISBLANK(C1171),\"\",(IF((C1171<=E1171),\"X\",\"\")))","v":""},null,null,"",null,null,"--"]
[null,null,null,null,null,null,null,null,null,null,null,{"$f":"L1171","v":"--"}]
["R40",{"$f":"IF(ISTEXT(VLOOKUP(A1173,'FICHA DE PROJETO'!$A$33:$I$213,2,FALSE)),VLOOKUP(A1173,'FICHA DE PROJETO'!$A$33:$I$213,2,FALSE),\"\")","v":""},null,null,null,null,null,null,null,null,null,{"$f":"IF((B1173=\"\"),\"--\",\"X\")","v":"--"}]
[null,null,"LEI",null,"PROJETO","ATENDEU À LEGISLAÇÃO",null,null,"NÃO ATENDEU À LEGISLAÇÃO",null,null,{"$f":"L1173","v":"--"}]
["Caracterização da Via: ",null,null,null,null,{"$f":"IF(ISBLANK(C1175),\"\",(IF((C1175=E1175),\"X\",\"\")))","v":""},null,null,{"$f":"IF(NOT(C1175=E1175),\"X\",\"\")","v":""},null,null,{"$f":"L1174","v":"--"}]
["Largura da Caixa da Via:",null,null,null,null,{"$f":"IF(ISBLANK(C1176),\"\",(IF((C1176<=E1176),\"X\",\"\")))","v":""},null,null,{"$f":"IF(ISBLANK(C1176),\"\",(IF((C1176>E1176),\"X\",\"\")))","v":""},null,null,{"$f":"L1175","v":"--"}]
["Largura da Pista ",null,null,null,null,"",null,null,"",null,null,"--"]
["Largura da calçada",null,null,null,null,"",null,null,"",null,null,"--"]
["Largura do passeio",null,null,null,null,"",null,null,"",null,null,"--"]
["Ciclovia",null,null,null,null,{"$f":"IF(ISBLANK(C1180),\"\",(IF((C1180<=E1180),\"X\",\"\")))","v":""},null,null,"",null,null,"--"]
["Ciclofaixa",null,null,null,null,{"$f":"IF(ISBLANK(C1181),\"\",(IF((C1181<=E1181),\"X\",\"\")))","v":""},null,null,"",null,null,"--"]
[null,null,null,null,null,null,null,null,null,null,null,{"$f":"L1181","v":"--"}]
["R41",{"$f":"IF(ISTEXT(VLOOKUP(A1183,'FICHA DE PROJETO'!$A$33:$I$213,2,FALSE)),VLOOKUP(A1183,'FICHA DE PROJETO'!$A$33:$I$213,2,FALSE),\"\")","v":""},null,null,null,null,null,null,null,null,null,{"$f":"IF((B1183=\"\"),\"--\",\"X\")","v":"--"}]
[null,null,"LEI",null,"PROJETO","ATENDEU À LEGISLAÇÃO",null,null,"NÃO ATENDEU À LEGISLAÇÃO",null,null,{"$f":"L1183","v":"--"}]
["Caracterização da Via: ",null,null,null,null,{"$f":"IF(ISBLANK(C1185),\"\",(IF((C1185=E1185),\"X\",\"\")))","v":""},null,null,{"$f":"IF(NOT(C1185=E1185),\"X\",\"\")","v":""},null,null,{"$f":"L1184","v":"--"}]
["Largura da Caixa da Via:",null,null,null,null,{"$f":"IF(ISBLANK(C1186),\"\",(IF((C1186<=E1186),\"X\",\"\")))","v":""},null,null,{"$f":"IF(ISBLANK(C1186),\"\",(IF((C1186>E1186),\"X\",\"\")))","v":""},null,null,{"$f":"L1185","v":"--"}]
["Largura da Pista ",null,null,null,null,"",null,null,"",null,null,"--"]
["Largura da calçada",null,null,null,null,"",null,null,"",null,null,"--"]
["Largura do passeio",null,null,null,null,"",null,null,"",null,null,"--"]
["Ciclovia",null,null,null,null,{"$f":"IF(ISBLANK(C1190),\"\",(IF((C1190<=E1190),\"X\",\"\")))","v":""},null,null,"",null,null,"--"]
["Ciclofaixa",null,null,null,null,{"$f":"IF(ISBLANK(C1191),\"\",(IF((C1191<=E1191),\"X\",\"\")))","v":""},null,null,"",null,null,"--"]
[null,null,null,null,null,null,null,null,null,null,null,{"$f":"L1191","v":"--"}]
["R42",{"$f":"IF(ISTEXT(VLOOKUP(A1193,'FICHA DE PROJETO'!$A$33:$I$213,2,FALSE)),VLOOKUP(A1193,'FICHA DE PROJETO'!$A$33:$I$213,2,FALSE),\"\")","v":""},null,null,null,null,null,null,null,null,null,{"$f":"IF((B1193=\"\"),\"--\",\"X\")","v":"--"}]
[null,null,"LEI",null,"PROJETO","ATENDEU À LEGISLAÇÃO",null,null,"NÃO ATENDEU À LEGISLAÇÃO",null,null,{"$f":"L1193","v":"--"}]
["Caracterização da Via: ",null,null,null,null,{"$f":"IF(ISBLANK(C1195),\"\",(IF((C1195=E1195),\"X\",\"\")))","v":""},null,null,{"$f":"IF(NOT(C1195=E1195),\"X\",\"\")","v":""},null,null,{"$f":"L1194","v":"--"}]
["Largura da Caixa da Via:",null,null,null,null,{"$f":"IF(ISBLANK(C1196),\"\",(IF((C1196<=E1196),\"X\",\"\")))","v":""},null,null,{"$f":"IF(ISBLANK(C1196),\"\",(IF((C1196>E1196),\"X\",\"\")))","v":""},null,null,{"$f":"L1195","v":"--"}]
["Largura da Pista ",null,null,null,null,"",null,null,"",null,null,"--"]
["Largura da calçada",null,null,null,null,"",null,null,"",null,null,"--"]
["Largura do passeio",null,null,null,null,"",null,null,"",null,null,"--"]
["Ciclovia",null,null,null,null,{"$f":"IF(ISBLANK(C1200),\"\",(IF((C1200<=E1200),\"X\",\"\")))","v":""},null,null,"",null,null,"--"]
["Ciclofaixa",null,null,null,null,{"$f":"IF(ISBLANK(C1201),\"\",(IF((C1201<=E1201),\"X\",\"\")))","v":""},null,null,"",null,null,"--"]
[null,null,null,null,null,null,null,null,null,null,null,{"$f":"L1201","v":"--"}]
["R43",{"$f":"IF(ISTEXT(VLOOKUP(A1203,'FICHA DE PROJETO'!$A$33:$I$213,2,FALSE)),VLOOKUP(A1203,'FICHA DE PROJETO'!$A$33:$I$213,2,FALSE),\"\")","v":""},null,null,null,null,null,null,null,null,null,{"$f":"IF((B1203=\"\"),\"--\",\"X\")","v":"--"}]
[null,null,"LEI",null,"PROJETO","ATENDEU À LEGISLAÇÃO",null,null,"NÃO ATENDEU À LEGISLAÇÃO",null,null,{"$f":"L1203","v":"--"}]
["Caracterização da Via: ",null,null,null,null,{"$f":"IF(ISBLANK(C1205),\"\",(IF((C1205=E1205),\"X\",\"\")))","v":""},null,null,{"$f":"IF(NOT(C1205=E1205),\"X\",\"\")","v":""},null,null,{"$f":"L1204","v":"--"}]
["Largura da Caixa da Via:",null,null,null,null,{"$f":"IF(ISBLANK(C1206),\"\",(IF((C1206<=E1206),\"X\",\"\")))","v":""},null,null,{"$f":"IF(ISBLANK(C1206),\"\",(IF((C1206>E1206),\"X\",\"\")))","v":""},null,null,{"$f":"L1205","v":"--"}]
["Largura da Pista ",null,null,null,null,"",null,null,"",null,null,"--"]
["Largura da calçada",null,null,null,null,"",null,null,"",null,null,"--"]
["Largura do passeio",null,null,null,null,"",null,null,"",null,null,"--"]
["Ciclovia",null,null,null,null,{"$f":"IF(ISBLANK(C1210),\"\",(IF((C1210<=E1210),\"X\",\"\")))","v":""},null,null,"",null,null,"--"]
["Ciclofaixa",null,null,null,null,{"$f":"IF(ISBLANK(C1211),\"\",(IF((C1211<=E1211),\"X\",\"\")))","v":""},null,null,"",null,null,"--"]
[null,null,null,null,null,null,null,null,null,null,null,{"$f":"L1211","v":"--"}]
["R44",{"$f":"IF(ISTEXT(VLOOKUP(A1213,'FICHA DE PROJETO'!$A$33:$I$213,2,FALSE)),VLOOKUP(A1213,'FICHA DE PROJETO'!$A$33:$I$213,2,FALSE),\"\")","v":""},null,null,null,null,null,null,null,null,null,{"$f":"IF((B1213=\"\"),\"--\",\"X\")","v":"--"}]
[null,null,"LEI",null,"PROJETO","ATENDEU À LEGISLAÇÃO",null,null,"NÃO ATENDEU À LEGISLAÇÃO",null,null,{"$f":"L1213","v":"--"}]
["Caracterização da Via: ",null,null,null,null,{"$f":"IF(ISBLANK(C1215),\"\",(IF((C1215=E1215),\"X\",\"\")))","v":""},null,null,{"$f":"IF(NOT(C1215=E1215),\"X\",\"\")","v":""},null,null,{"$f":"L1214","v":"--"}]
["Largura da Caixa da Via:",null,null,null,null,{"$f":"IF(ISBLANK(C1216),\"\",(IF((C1216<=E1216),\"X\",\"\")))","v":""},null,null,{"$f":"IF(ISBLANK(C1216),\"\",(IF((C1216>E1216),\"X\",\"\")))","v":""},null,null,{"$f":"L1215","v":"--"}]
["Largura da Pista ",null,null,null,null,"",null,null,"",null,null,"--"]
["Largura da calçada",null,null,null,null,"",null,null,"",null,null,"--"]
["Largura do passeio",null,null,null,null,"",null,null,"",null,null,"--"]
["Ciclovia",null,null,null,null,{"$f":"IF(ISBLANK(C1220),\"\",(IF((C1220<=E1220),\"X\",\"\")))","v":""},null,null,"",null,null,"--"]
["Ciclofaixa",null,null,null,null,{"$f":"IF(ISBLANK(C1221),\"\",(IF((C1221<=E1221),\"X\",\"\")))","v":""},null,null,"",null,null,"--"]
[null,null,null,null,null,null,null,null,null,null,null,{"$f":"L1221","v":"--"}]
["R45",{"$f":"IF(ISTEXT(VLOOKUP(A1223,'FICHA DE PROJETO'!$A$33:$I$213,2,FALSE)),VLOOKUP(A1223,'FICHA DE PROJETO'!$A$33:$I$213,2,FALSE),\"\")","v":""},null,null,null,null,null,null,null,null,null,{"$f":"IF((B1223=\"\"),\"--\",\"X\")","v":"--"}]
[null,null,"LEI",null,"PROJETO","ATENDEU À LEGISLAÇÃO",null,null,"NÃO ATENDEU À LEGISLAÇÃO",null,null,{"$f":"L1223","v":"--"}]
["Caracterização da Via: ",null,null,null,null,{"$f":"IF(ISBLANK(C1225),\"\",(IF((C1225=E1225),\"X\",\"\")))","v":""},null,null,{"$f":"IF(NOT(C1225=E1225),\"X\",\"\")","v":""},null,null,{"$f":"L1224","v":"--"}]
["Largura da Caixa da Via:",null,null,null,null,{"$f":"IF(ISBLANK(C1226),\"\",(IF((C1226<=E1226),\"X\",\"\")))","v":""},null,null,{"$f":"IF(ISBLANK(C1226),\"\",(IF((C1226>E1226),\"X\",\"\")))","v":""},null,null,{"$f":"L1225","v":"--"}]
["Largura da Pista ",null,null,null,null,"",null,null,"",null,null,"--"]
["Largura da calçada",null,null,null,null,"",null,null,"",null,null,"--"]
["Largura do passeio",null,null,null,null,"",null,null,"",null,null,"--"]
["Ciclovia",null,null,null,null,{"$f":"IF(ISBLANK(C1230),\"\",(IF((C1230<=E1230),\"X\",\"\")))","v":""},null,null,"",null,null,"--"]
["Ciclofaixa",null,null,null,null,{"$f":"IF(ISBLANK(C1231),\"\",(IF((C1231<=E1231),\"X\",\"\")))","v":""},null,null,"",null,null,"--"]
[null,null,null,null,null,null,null,null,null,null,null,{"$f":"L1231","v":"--"}]
["R46",{"$f":"IF(ISTEXT(VLOOKUP(A1233,'FICHA DE PROJETO'!$A$33:$I$213,2,FALSE)),VLOOKUP(A1233,'FICHA DE PROJETO'!$A$33:$I$213,2,FALSE),\"\")","v":""},null,null,null,null,null,null,null,null,null,{"$f":"IF((B1233=\"\"),\"--\",\"X\")","v":"--"}]
[null,null,"LEI",null,"PROJETO","ATENDEU À LEGISLAÇÃO",null,null,"NÃO ATENDEU À LEGISLAÇÃO",null,null,{"$f":"L1233","v":"--"}]
["Caracterização da Via: ",null,null,null,null,{"$f":"IF(ISBLANK(C1235),\"\",(IF((C1235=E1235),\"X\",\"\")))","v":""},null,null,{"$f":"IF(NOT(C1235=E1235),\"X\",\"\")","v":""},null,null,{"$f":"L1234","v":"--"}]
["Largura da Caixa da Via:",null,null,null,null,{"$f":"IF(ISBLANK(C1236),\"\",(IF((C1236<=E1236),\"X\",\"\")))","v":""},null,null,{"$f":"IF(ISBLANK(C1236),\"\",(IF((C1236>E1236),\"X\",\"\")))","v":""},null,null,{"$f":"L1235","v":"--"}]
["Largura da Pista ",null,null,null,null,"",null,null,"",null,null,"--"]
["Largura da calçada",null,null,null,null,"",null,null,"",null,null,"--"]
["Largura do passeio",null,null,null,null,"",null,null,"",null,null,"--"]
["Ciclovia",null,null,null,null,{"$f":"IF(ISBLANK(C1240),\"\",(IF((C1240<=E1240),\"X\",\"\")))","v":""},null,null,"",null,null,"--"]
["Ciclofaixa",null,null,null,null,{"$f":"IF(ISBLANK(C1241),\"\",(IF((C1241<=E1241),\"X\",\"\")))","v":""},null,null,"",null,null,"--"]
[null,null,null,null,null,null,null,null,null,null,null,{"$f":"L1241","v":"--"}]
["R47",{"$f":"IF(ISTEXT(VLOOKUP(A1243,'FICHA DE PROJETO'!$A$33:$I$213,2,FALSE)),VLOOKUP(A1243,'FICHA DE PROJETO'!$A$33:$I$213,2,FALSE),\"\")","v":""},null,null,null,null,null,null,null,null,null,{"$f":"IF((B1243=\"\"),\"--\",\"X\")","v":"--"}]
[null,null,"LEI",null,"PROJETO","ATENDEU À LEGISLAÇÃO",null,null,"NÃO ATENDEU À LEGISLAÇÃO",null,null,{"$f":"L1243","v":"--"}]
["Caracterização da Via: ",null,null,null,null,{"$f":"IF(ISBLANK(C1245),\"\",(IF((C1245=E1245),\"X\",\"\")))","v":""},null,null,{"$f":"IF(NOT(C1245=E1245),\"X\",\"\")","v":""},null,null,{"$f":"L1244","v":"--"}]
["Largura da Caixa da Via:",null,null,null,null,{"$f":"IF(ISBLANK(C1246),\"\",(IF((C1246<=E1246),\"X\",\"\")))","v":""},null,null,{"$f":"IF(ISBLANK(C1246),\"\",(IF((C1246>E1246),\"X\",\"\")))","v":""},null,null,{"$f":"L1245","v":"--"}]
["Largura da Pista ",null,null,null,null,"",null,null,"",null,null,"--"]
["Largura da calçada",null,null,null,null,"",null,null,"",null,null,"--"]
["Largura do passeio",null,null,null,null,"",null,null,"",null,null,"--"]
["Ciclovia",null,null,null,null,{"$f":"IF(ISBLANK(C1250),\"\",(IF((C1250<=E1250),\"X\",\"\")))","v":""},null,null,"",null,null,"--"]
["Ciclofaixa",null,null,null,null,{"$f":"IF(ISBLANK(C1251),\"\",(IF((C1251<=E1251),\"X\",\"\")))","v":""},null,null,"",null,null,"--"]
[null,null,null,null,null,null,null,null,null,null,null,{"$f":"L1251","v":"--"}]
["R48",{"$f":"IF(ISTEXT(VLOOKUP(A1253,'FICHA DE PROJETO'!$A$33:$I$213,2,FALSE)),VLOOKUP(A1253,'FICHA DE PROJETO'!$A$33:$I$213,2,FALSE),\"\")","v":""},null,null,null,null,null,null,null,null,null,{"$f":"IF((B1253=\"\"),\"--\",\"X\")","v":"--"}]
[null,null,"LEI",null,"PROJETO","ATENDEU À LEGISLAÇÃO",null,null,"NÃO ATENDEU À LEGISLAÇÃO",null,null,{"$f":"L1253","v":"--"}]
["Caracterização da Via: ",null,null,null,null,{"$f":"IF(ISBLANK(C1255),\"\",(IF((C1255=E1255),\"X\",\"\")))","v":""},null,null,{"$f":"IF(NOT(C1255=E1255),\"X\",\"\")","v":""},null,null,{"$f":"L1254","v":"--"}]
["Largura da Caixa da Via:",null,null,null,null,{"$f":"IF(ISBLANK(C1256),\"\",(IF((C1256<=E1256),\"X\",\"\")))","v":""},null,null,{"$f":"IF(ISBLANK(C1256),\"\",(IF((C1256>E1256),\"X\",\"\")))","v":""},null,null,{"$f":"L1255","v":"--"}]
["Largura da Pista ",null,null,null,null,"",null,null,"",null,null,"--"]
["Largura da calçada",null,null,null,null,"",null,null,"",null,null,"--"]
["Largura do passeio",null,null,null,null,"",null,null,"",null,null,"--"]
["Ciclovia",null,null,null,null,{"$f":"IF(ISBLANK(C1260),\"\",(IF((C1260<=E1260),\"X\",\"\")))","v":""},null,null,"",null,null,"--"]
["Ciclofaixa",null,null,null,null,{"$f":"IF(ISBLANK(C1261),\"\",(IF((C1261<=E1261),\"X\",\"\")))","v":""},null,null,"",null,null,"--"]
[null,null,null,null,null,null,null,null,null,null,null,{"$f":"L1261","v":"--"}]
["R49",{"$f":"IF(ISTEXT(VLOOKUP(A1263,'FICHA DE PROJETO'!$A$33:$I$213,2,FALSE)),VLOOKUP(A1263,'FICHA DE PROJETO'!$A$33:$I$213,2,FALSE),\"\")","v":""},null,null,null,null,null,null,null,null,null,{"$f":"IF((B1263=\"\"),\"--\",\"X\")","v":"--"}]
[null,null,"LEI",null,"PROJETO","ATENDEU À LEGISLAÇÃO",null,null,"NÃO ATENDEU À LEGISLAÇÃO",null,null,{"$f":"L1263","v":"--"}]
["Caracterização da Via: ",null,null,null,null,{"$f":"IF(ISBLANK(C1265),\"\",(IF((C1265=E1265),\"X\",\"\")))","v":""},null,null,{"$f":"IF(NOT(C1265=E1265),\"X\",\"\")","v":""},null,null,{"$f":"L1264","v":"--"}]
["Largura da Caixa da Via:",null,null,null,null,{"$f":"IF(ISBLANK(C1266),\"\",(IF((C1266<=E1266),\"X\",\"\")))","v":""},null,null,{"$f":"IF(ISBLANK(C1266),\"\",(IF((C1266>E1266),\"X\",\"\")))","v":""},null,null,{"$f":"L1265","v":"--"}]
["Largura da Pista ",null,null,null,null,"",null,null,"",null,null,"--"]
["Largura da calçada",null,null,null,null,"",null,null,"",null,null,"--"]
["Largura do passeio",null,null,null,null,"",null,null,"",null,null,"--"]
["Ciclovia",null,null,null,null,{"$f":"IF(ISBLANK(C1270),\"\",(IF((C1270<=E1270),\"X\",\"\")))","v":""},null,null,"",null,null,"--"]
["Ciclofaixa",null,null,null,null,{"$f":"IF(ISBLANK(C1271),\"\",(IF((C1271<=E1271),\"X\",\"\")))","v":""},null,null,"",null,null,"--"]
[null,null,null,null,null,null,null,null,null,null,null,{"$f":"L1271","v":"--"}]
["R50",{"$f":"IF(ISTEXT(VLOOKUP(A1273,'FICHA DE PROJETO'!$A$33:$I$213,2,FALSE)),VLOOKUP(A1273,'FICHA DE PROJETO'!$A$33:$I$213,2,FALSE),\"\")","v":""},null,null,null,null,null,null,null,null,null,{"$f":"IF((B1273=\"\"),\"--\",\"X\")","v":"--"}]
[null,null,"LEI",null,"PROJETO","ATENDEU À LEGISLAÇÃO",null,null,"NÃO ATENDEU À LEGISLAÇÃO",null,null,{"$f":"L1273","v":"--"}]
["Caracterização da Via: ",null,null,null,null,{"$f":"IF(ISBLANK(C1275),\"\",(IF((C1275=E1275),\"X\",\"\")))","v":""},null,null,{"$f":"IF(NOT(C1275=E1275),\"X\",\"\")","v":""},null,null,{"$f":"L1274","v":"--"}]
["Largura da Caixa da Via:",null,null,null,null,{"$f":"IF(ISBLANK(C1276),\"\",(IF((C1276<=E1276),\"X\",\"\")))","v":""},null,null,{"$f":"IF(ISBLANK(C1276),\"\",(IF((C1276>E1276),\"X\",\"\")))","v":""},null,null,{"$f":"L1275","v":"--"}]
["Largura da Pista ",null,null,null,null,"",null,null,"",null,null,"--"]
["Largura da calçada",null,null,null,null,"",null,null,"",null,null,"--"]
["Largura do passeio",null,null,null,null,"",null,null,"",null,null,"--"]
["Ciclovia",null,null,null,null,{"$f":"IF(ISBLANK(C1280),\"\",(IF((C1280<=E1280),\"X\",\"\")))","v":""},null,null,"",null,null,"--"]
["Ciclofaixa",null,null,null,null,{"$f":"IF(ISBLANK(C1281),\"\",(IF((C1281<=E1281),\"X\",\"\")))","v":""},null,null,"",null,null,"--"]
[null,null,null,null,null,null,null,null,null,null,null,{"$f":"L1281","v":"--"}]
["RUAS DO LOTE 02",null,null,null,null,null,null,null,null,null,null,{"$f":"IF('FICHA DE PROJETO'!K215=\"X\",\"X\",\"--\")","v":"--"}]
["R01",{"$f":"IF(ISTEXT(VLOOKUP(A1284,'FICHA DE PROJETO'!$A$216:$I$398,2,FALSE)),VLOOKUP(A1284,'FICHA DE PROJETO'!$A$216:$I$398,2,FALSE),\"\")","v":""},null,null,null,null,null,null,null,null,null,{"$f":"IF((B1284=\"\"),\"--\",\"X\")","v":"--"}]
[null,null,"LEI",null,"PROJETO","ATENDEU À LEGISLAÇÃO",null,null,"NÃO ATENDEU À LEGISLAÇÃO",null,null,{"$f":"L1284","v":"--"}]
["Caracterização da Via: ",null,"Local",null,"Local",{"$f":"IF(ISBLANK(C1286),\"\",(IF((C1286=E1286),\"X\",\"\")))","v":"X"},null,null,{"$f":"IF(NOT(C1286=E1286),\"X\",\"\")","v":""},null,null,{"$f":"L1285","v":"--"}]
["Largura da Caixa da Via:",null,18,null,19,{"$f":"IF(ISBLANK(C1287),\"\",(IF((C1287<=E1287),\"X\",\"\")))","v":"X"},null,null,{"$f":"IF(ISBLANK(C1287),\"\",(IF((C1287>E1287),\"X\",\"\")))","v":""},null,null,{"$f":"L1286","v":"--"}]
["Largura da Pista ",null,10,null,9,{"$f":"IF(ISBLANK(C1288),\"\",(IF((C1288<=E1288),\"X\",\"\")))","v":""},null,null,"X",null,null,"--"]
["Largura da calçada",null,4,null,5,"X",null,null,"",null,null,"--"]
["Largura do passeio",null,1.5,null,1.2,"",null,null,"X",null,null,"--"]
["Ciclovia",null,null,null,null,"",null,null,"",null,null,"--"]
["Ciclofaixa",null,null,null,null,"",null,null,"",null,null,"--"]
[null,null,null,null,null,null,null,null,null,null,null,{"$f":"L1292","v":"--"}]
["R02",{"$f":"IF(ISTEXT(VLOOKUP(A1294,'FICHA DE PROJETO'!$A$216:$I$398,2,FALSE)),VLOOKUP(A1294,'FICHA DE PROJETO'!$A$216:$I$398,2,FALSE),\"\")","v":""},null,null,null,null,null,null,null,null,null,{"$f":"IF((B1294=\"\"),\"--\",\"X\")","v":"--"}]
[null,null,"LEI",null,"PROJETO","ATENDEU À LEGISLAÇÃO",null,null,"NÃO ATENDEU À LEGISLAÇÃO",null,null,{"$f":"L1294","v":"--"}]
["Caracterização da Via: ",null,"Local",null,"Local",{"$f":"IF(ISBLANK(C1296),\"\",(IF((C1296=E1296),\"X\",\"\")))","v":"X"},null,null,{"$f":"IF(NOT(C1296=E1296),\"X\",\"\")","v":""},null,null,{"$f":"L1295","v":"--"}]
["Largura da Caixa da Via:",null,14,null,14,{"$f":"IF(ISBLANK(C1297),\"\",(IF((C1297<=E1297),\"X\",\"\")))","v":"X"},null,null,{"$f":"IF(ISBLANK(C1297),\"\",(IF((C1297>E1297),\"X\",\"\")))","v":""},null,null,{"$f":"L1296","v":"--"}]
["Largura da Pista ",null,7,null,6,{"$f":"IF(ISBLANK(C1298),\"\",(IF((C1298<=E1298),\"X\",\"\")))","v":""},null,null,"X",null,null,"--"]
["Largura da calçada",null,3,null,2.5,"",null,null,"X",null,null,"--"]
["Largura do passeio",null,1.5,null,1.2,"",null,null,"X",null,null,"--"]
["Ciclovia",null,null,null,null,"",null,null,"",null,null,"--"]
["Ciclofaixa",null,null,null,null,"",null,null,"",null,null,"--"]
[null,null,null,null,null,null,null,null,null,null,null,{"$f":"L1302","v":"--"}]
["R03",{"$f":"IF(ISTEXT(VLOOKUP(A1304,'FICHA DE PROJETO'!$A$216:$I$398,2,FALSE)),VLOOKUP(A1304,'FICHA DE PROJETO'!$A$216:$I$398,2,FALSE),\"\")","v":""},null,null,null,null,null,null,null,null,null,{"$f":"IF((B1304=\"\"),\"--\",\"X\")","v":"--"}]
[null,null,"LEI",null,"PROJETO","ATENDEU À LEGISLAÇÃO",null,null,"NÃO ATENDEU À LEGISLAÇÃO",null,null,{"$f":"L1304","v":"--"}]
["Caracterização da Via: ",null,"Local",null,"Local",{"$f":"IF(ISBLANK(C1306),\"\",(IF((C1306=E1306),\"X\",\"\")))","v":"X"},null,null,{"$f":"IF(NOT(C1306=E1306),\"X\",\"\")","v":""},null,null,{"$f":"L1305","v":"--"}]
["Largura da Caixa da Via:",null,15,null,15,{"$f":"IF(ISBLANK(C1307),\"\",(IF((C1307<=E1307),\"X\",\"\")))","v":"X"},null,null,{"$f":"IF(ISBLANK(C1307),\"\",(IF((C1307>E1307),\"X\",\"\")))","v":""},null,null,{"$f":"L1306","v":"--"}]
["Largura da Pista ",null,7,null,6,{"$f":"IF(ISBLANK(C1308),\"\",(IF((C1308<=E1308),\"X\",\"\")))","v":""},null,null,"X",null,null,"--"]
["Largura da calçada",null,3,null,2.5,"",null,null,"X",null,null,"--"]
["Largura do passeio",null,1.5,null,1.2,"",null,null,"X",null,null,"--"]
["Ciclovia",null,null,null,null,"",null,null,"",null,null,"--"]
["Ciclofaixa",null,null,null,null,"",null,null,"",null,null,"--"]
[null,null,null,null,null,null,null,null,null,null,null,{"$f":"L1312","v":"--"}]
["R04",{"$f":"IF(ISTEXT(VLOOKUP(A1314,'FICHA DE PROJETO'!$A$216:$I$398,2,FALSE)),VLOOKUP(A1314,'FICHA DE PROJETO'!$A$216:$I$398,2,FALSE),\"\")","v":""},null,null,null,null,null,null,null,null,null,{"$f":"IF((B1314=\"\"),\"--\",\"X\")","v":"--"}]
[null,null,"LEI",null,"PROJETO","ATENDEU À LEGISLAÇÃO",null,null,"NÃO ATENDEU À LEGISLAÇÃO",null,null,{"$f":"L1314","v":"--"}]
["Caracterização da Via: ",null,"Local",null,"Local",{"$f":"IF(ISBLANK(C1316),\"\",(IF((C1316=E1316),\"X\",\"\")))","v":"X"},null,null,{"$f":"IF(NOT(C1316=E1316),\"X\",\"\")","v":""},null,null,{"$f":"L1315","v":"--"}]
["Largura da Caixa da Via:",null,14,null,12,{"$f":"IF(ISBLANK(C1317),\"\",(IF((C1317<=E1317),\"X\",\"\")))","v":""},null,null,{"$f":"IF(ISBLANK(C1317),\"\",(IF((C1317>E1317),\"X\",\"\")))","v":"X"},null,null,{"$f":"L1316","v":"--"}]
["Largura da Pista ",null,8,null,7,{"$f":"IF(ISBLANK(C1318),\"\",(IF((C1318<=E1318),\"X\",\"\")))","v":""},null,null,"X",null,null,"--"]
["Largura da calçada",null,3,null,3.5,"X",null,null,"",null,null,"--"]
["Largura do passeio",null,1.5,null,1.2,"",null,null,"X",null,null,"--"]
["Ciclovia",null,null,null,null,"",null,null,"",null,null,"--"]
["Ciclofaixa",null,null,null,null,"",null,null,"",null,null,"--"]
[null,null,null,null,null,null,null,null,null,null,null,{"$f":"L1322","v":"--"}]
["R05",{"$f":"IF(ISTEXT(VLOOKUP(A1324,'FICHA DE PROJETO'!$A$216:$I$398,2,FALSE)),VLOOKUP(A1324,'FICHA DE PROJETO'!$A$216:$I$398,2,FALSE),\"\")","v":""},null,null,null,null,null,null,null,null,null,{"$f":"IF((B1324=\"\"),\"--\",\"X\")","v":"--"}]
[null,null,"LEI",null,"PROJETO","ATENDEU À LEGISLAÇÃO",null,null,"NÃO ATENDEU À LEGISLAÇÃO",null,null,{"$f":"L1324","v":"--"}]
["Caracterização da Via: ",null,null,null,null,{"$f":"IF(ISBLANK(C1326),\"\",(IF((C1326=E1326),\"X\",\"\")))","v":""},null,null,{"$f":"IF(NOT(C1326=E1326),\"X\",\"\")","v":""},null,null,{"$f":"L1325","v":"--"}]
["Largura da Caixa da Via:",null,null,null,null,{"$f":"IF(ISBLANK(C1327),\"\",(IF((C1327<=E1327),\"X\",\"\")))","v":""},null,null,{"$f":"IF(ISBLANK(C1327),\"\",(IF((C1327>E1327),\"X\",\"\")))","v":""},null,null,{"$f":"L1326","v":"--"}]
["Largura da Pista ",null,null,null,null,{"$f":"IF(ISBLANK(C1328),\"\",(IF((C1328<=E1328),\"X\",\"\")))","v":""},null,null,"",null,null,"--"]
["Largura da calçada",null,null,null,null,"",null,null,"",null,null,"--"]
["Largura do passeio",null,null,null,null,"",null,null,"",null,null,"--"]
["Ciclovia",null,null,null,null,"",null,null,"",null,null,"--"]
["Ciclofaixa",null,null,null,null,"",null,null,"",null,null,"--"]
[null,null,null,null,null,null,null,null,null,null,null,{"$f":"L1332","v":"--"}]
["R06",{"$f":"IF(ISTEXT(VLOOKUP(A1334,'FICHA DE PROJETO'!$A$216:$I$398,2,FALSE)),VLOOKUP(A1334,'FICHA DE PROJETO'!$A$216:$I$398,2,FALSE),\"\")","v":""},null,null,null,null,null,null,null,null,null,{"$f":"IF((B1334=\"\"),\"--\",\"X\")","v":"--"}]
[null,null,"LEI",null,"PROJETO","ATENDEU À LEGISLAÇÃO",null,null,"NÃO ATENDEU À LEGISLAÇÃO",null,null,{"$f":"L1334","v":"--"}]
["Caracterização da Via: ",null,null,null,null,{"$f":"IF(ISBLANK(C1336),\"\",(IF((C1336=E1336),\"X\",\"\")))","v":""},null,null,{"$f":"IF(NOT(C1336=E1336),\"X\",\"\")","v":""},null,null,{"$f":"L1335","v":"--"}]
["Largura da Caixa da Via:",null,null,null,null,{"$f":"IF(ISBLANK(C1337),\"\",(IF((C1337<=E1337),\"X\",\"\")))","v":""},null,null,{"$f":"IF(ISBLANK(C1337),\"\",(IF((C1337>E1337),\"X\",\"\")))","v":""},null,null,{"$f":"L1336","v":"--"}]
["Largura da Pista ",null,null,null,null,{"$f":"IF(ISBLANK(C1338),\"\",(IF((C1338<=E1338),\"X\",\"\")))","v":""},null,null,"",null,null,"--"]
["Largura da calçada",null,null,null,null,"",null,null,"",null,null,"--"]
["Largura do passeio",null,null,null,null,"",null,null,"",null,null,"--"]
["Ciclovia",null,null,null,null,"",null,null,"",null,null,"--"]
["Ciclofaixa",null,null,null,null,"",null,null,"",null,null,"--"]
[null,null,null,null,null,null,null,null,null,null,null,{"$f":"L1342","v":"--"}]
["R07",{"$f":"IF(ISTEXT(VLOOKUP(A1344,'FICHA DE PROJETO'!$A$216:$I$398,2,FALSE)),VLOOKUP(A1344,'FICHA DE PROJETO'!$A$216:$I$398,2,FALSE),\"\")","v":""},null,null,null,null,null,null,null,null,null,{"$f":"IF((B1344=\"\"),\"--\",\"X\")","v":"--"}]
[null,null,"LEI",null,"PROJETO","ATENDEU À LEGISLAÇÃO",null,null,"NÃO ATENDEU À LEGISLAÇÃO",null,null,{"$f":"L1344","v":"--"}]
["Caracterização da Via: ",null,null,null,null,{"$f":"IF(ISBLANK(C1346),\"\",(IF((C1346=E1346),\"X\",\"\")))","v":""},null,null,{"$f":"IF(NOT(C1346=E1346),\"X\",\"\")","v":""},null,null,{"$f":"L1345","v":"--"}]
["Largura da Caixa da Via:",null,null,null,null,{"$f":"IF(ISBLANK(C1347),\"\",(IF((C1347<=E1347),\"X\",\"\")))","v":""},null,null,{"$f":"IF(ISBLANK(C1347),\"\",(IF((C1347>E1347),\"X\",\"\")))","v":""},null,null,{"$f":"L1346","v":"--"}]
["Largura da Pista ",null,null,null,null,{"$f":"IF(ISBLANK(C1348),\"\",(IF((C1348<=E1348),\"X\",\"\")))","v":""},null,null,"",null,null,"--"]
["Largura da calçada",null,null,null,null,"",null,null,"",null,null,"--"]
["Largura do passeio",null,null,null,null,"",null,null,"",null,null,"--"]
["Ciclovia",null,null,null,null,"",null,null,"",null,null,"--"]
["Ciclofaixa",null,null,null,null,"",null,null,"",null,null,"--"]
[null,null,null,null,null,null,null,null,null,null,null,{"$f":"L1352","v":"--"}]
["R08",{"$f":"IF(ISTEXT(VLOOKUP(A1354,'FICHA DE PROJETO'!$A$216:$I$398,2,FALSE)),VLOOKUP(A1354,'FICHA DE PROJETO'!$A$216:$I$398,2,FALSE),\"\")","v":""},null,null,null,null,null,null,null,null,null,{"$f":"IF((B1354=\"\"),\"--\",\"X\")","v":"--"}]
[null,null,"LEI",null,"PROJETO","ATENDEU À LEGISLAÇÃO",null,null,"NÃO ATENDEU À LEGISLAÇÃO",null,null,{"$f":"L1354","v":"--"}]
["Caracterização da Via: ",null,null,null,null,{"$f":"IF(ISBLANK(C1356),\"\",(IF((C1356=E1356),\"X\",\"\")))","v":""},null,null,{"$f":"IF(NOT(C1356=E1356),\"X\",\"\")","v":""},null,null,{"$f":"L1355","v":"--"}]
["Largura da Caixa da Via:",null,null,null,null,{"$f":"IF(ISBLANK(C1357),\"\",(IF((C1357<=E1357),\"X\",\"\")))","v":""},null,null,{"$f":"IF(ISBLANK(C1357),\"\",(IF((C1357>E1357),\"X\",\"\")))","v":""},null,null,{"$f":"L1356","v":"--"}]
["Largura da Pista ",null,null,null,null,{"$f":"IF(ISBLANK(C1358),\"\",(IF((C1358<=E1358),\"X\",\"\")))","v":""},null,null,"",null,null,"--"]
["Largura da calçada",null,null,null,null,"",null,null,"",null,null,"--"]
["Largura do passeio",null,null,null,null,"",null,null,"",null,null,"--"]
["Ciclovia",null,null,null,null,"",null,null,"",null,null,"--"]
["Ciclofaixa",null,null,null,null,"",null,null,"",null,null,"--"]
[null,null,null,null,null,null,null,null,null,null,null,{"$f":"L1362","v":"--"}]
["R09",{"$f":"IF(ISTEXT(VLOOKUP(A1364,'FICHA DE PROJETO'!$A$216:$I$398,2,FALSE)),VLOOKUP(A1364,'FICHA DE PROJETO'!$A$216:$I$398,2,FALSE),\"\")","v":""},null,null,null,null,null,null,null,null,null,{"$f":"IF((B1364=\"\"),\"--\",\"X\")","v":"--"}]
[null,null,"LEI",null,"PROJETO","ATENDEU À LEGISLAÇÃO",null,null,"NÃO ATENDEU À LEGISLAÇÃO",null,null,{"$f":"L1364","v":"--"}]
["Caracterização da Via: ",null,null,null,null,{"$f":"IF(ISBLANK(C1366),\"\",(IF((C1366=E1366),\"X\",\"\")))","v":""},null,null,{"$f":"IF(NOT(C1366=E1366),\"X\",\"\")","v":""},null,null,{"$f":"L1365","v":"--"}]
["Largura da Caixa da Via:",null,null,null,null,{"$f":"IF(ISBLANK(C1367),\"\",(IF((C1367<=E1367),\"X\",\"\")))","v":""},null,null,{"$f":"IF(ISBLANK(C1367),\"\",(IF((C1367>E1367),\"X\",\"\")))","v":""},null,null,{"$f":"L1366","v":"--"}]
["Largura da Pista ",null,null,null,null,{"$f":"IF(ISBLANK(C1368),\"\",(IF((C1368<=E1368),\"X\",\"\")))","v":""},null,null,"",null,null,"--"]
["Largura da calçada",null,null,null,null,"",null,null,"",null,null,"--"]
["Largura do passeio",null,null,null,null,"",null,null,"",null,null,"--"]
["Ciclovia",null,null,null,null,"",null,null,"",null,null,"--"]
["Ciclofaixa",null,null,null,null,"",null,null,"",null,null,"--"]
[null,null,null,null,null,null,null,null,null,null,null,{"$f":"L1372","v":"--"}]
["R10",{"$f":"IF(ISTEXT(VLOOKUP(A1374,'FICHA DE PROJETO'!$A$216:$I$398,2,FALSE)),VLOOKUP(A1374,'FICHA DE PROJETO'!$A$216:$I$398,2,FALSE),\"\")","v":""},null,null,null,null,null,null,null,null,null,{"$f":"IF((B1374=\"\"),\"--\",\"X\")","v":"--"}]
[null,null,"LEI",null,"PROJETO","ATENDEU À LEGISLAÇÃO",null,null,"NÃO ATENDEU À LEGISLAÇÃO",null,null,{"$f":"L1374","v":"--"}]
["Caracterização da Via: ",null,null,null,null,{"$f":"IF(ISBLANK(C1376),\"\",(IF((C1376=E1376),\"X\",\"\")))","v":""},null,null,{"$f":"IF(NOT(C1376=E1376),\"X\",\"\")","v":""},null,null,{"$f":"L1375","v":"--"}]
["Largura da Caixa da Via:",null,null,null,null,{"$f":"IF(ISBLANK(C1377),\"\",(IF((C1377<=E1377),\"X\",\"\")))","v":""},null,null,{"$f":"IF(ISBLANK(C1377),\"\",(IF((C1377>E1377),\"X\",\"\")))","v":""},null,null,{"$f":"L1376","v":"--"}]
["Largura da Pista ",null,null,null,null,{"$f":"IF(ISBLANK(C1378),\"\",(IF((C1378<=E1378),\"X\",\"\")))","v":""},null,null,"",null,null,"--"]
["Largura da calçada",null,null,null,null,"",null,null,"",null,null,"--"]
["Largura do passeio",null,null,null,null,"",null,null,"",null,null,"--"]
["Ciclovia",null,null,null,null,"",null,null,"",null,null,"--"]
["Ciclofaixa",null,null,null,null,"",null,null,"",null,null,"--"]
[null,null,null,null,null,null,null,null,null,null,null,{"$f":"L1382","v":"--"}]
["R11",{"$f":"IF(ISTEXT(VLOOKUP(A1384,'FICHA DE PROJETO'!$A$216:$I$398,2,FALSE)),VLOOKUP(A1384,'FICHA DE PROJETO'!$A$216:$I$398,2,FALSE),\"\")","v":""},null,null,null,null,null,null,null,null,null,{"$f":"IF((B1384=\"\"),\"--\",\"X\")","v":"--"}]
[null,null,"LEI",null,"PROJETO","ATENDEU À LEGISLAÇÃO",null,null,"NÃO ATENDEU À LEGISLAÇÃO",null,null,{"$f":"L1384","v":"--"}]
["Caracterização da Via: ",null,null,null,null,{"$f":"IF(ISBLANK(C1386),\"\",(IF((C1386=E1386),\"X\",\"\")))","v":""},null,null,{"$f":"IF(NOT(C1386=E1386),\"X\",\"\")","v":""},null,null,{"$f":"L1385","v":"--"}]
["Largura da Caixa da Via:",null,null,null,null,{"$f":"IF(ISBLANK(C1387),\"\",(IF((C1387<=E1387),\"X\",\"\")))","v":""},null,null,{"$f":"IF(ISBLANK(C1387),\"\",(IF((C1387>E1387),\"X\",\"\")))","v":""},null,null,{"$f":"L1386","v":"--"}]
["Largura da Pista ",null,null,null,null,{"$f":"IF(ISBLANK(C1388),\"\",(IF((C1388<=E1388),\"X\",\"\")))","v":""},null,null,"",null,null,"--"]
["Largura da calçada",null,null,null,null,"",null,null,"",null,null,"--"]
["Largura do passeio",null,null,null,null,"",null,null,"",null,null,"--"]
["Ciclovia",null,null,null,null,"",null,null,"",null,null,"--"]
["Ciclofaixa",null,null,null,null,"",null,null,"",null,null,"--"]
[null,null,null,null,null,null,null,null,null,null,null,{"$f":"L1392","v":"--"}]
["R12",{"$f":"IF(ISTEXT(VLOOKUP(A1394,'FICHA DE PROJETO'!$A$216:$I$398,2,FALSE)),VLOOKUP(A1394,'FICHA DE PROJETO'!$A$216:$I$398,2,FALSE),\"\")","v":""},null,null,null,null,null,null,null,null,null,{"$f":"IF((B1394=\"\"),\"--\",\"X\")","v":"--"}]
[null,null,"LEI",null,"PROJETO","ATENDEU À LEGISLAÇÃO",null,null,"NÃO ATENDEU À LEGISLAÇÃO",null,null,{"$f":"L1394","v":"--"}]
["Caracterização da Via: ",null,null,null,null,{"$f":"IF(ISBLANK(C1396),\"\",(IF((C1396=E1396),\"X\",\"\")))","v":""},null,null,{"$f":"IF(NOT(C1396=E1396),\"X\",\"\")","v":""},null,null,{"$f":"L1395","v":"--"}]
["Largura da Caixa da Via:",null,null,null,null,{"$f":"IF(ISBLANK(C1397),\"\",(IF((C1397<=E1397),\"X\",\"\")))","v":""},null,null,{"$f":"IF(ISBLANK(C1397),\"\",(IF((C1397>E1397),\"X\",\"\")))","v":""},null,null,{"$f":"L1396","v":"--"}]
["Largura da Pista ",null,null,null,null,{"$f":"IF(ISBLANK(C1398),\"\",(IF((C1398<=E1398),\"X\",\"\")))","v":""},null,null,"",null,null,"--"]
["Largura da calçada",null,null,null,null,"",null,null,"",null,null,"--"]
["Largura do passeio",null,null,null,null,"",null,null,"",null,null,"--"]
["Ciclovia",null,null,null,null,"",null,null,"",null,null,"--"]
["Ciclofaixa",null,null,null,null,"",null,null,"",null,null,"--"]
[null,null,null,null,null,null,null,null,null,null,null,{"$f":"L1402","v":"--"}]
["R13",{"$f":"IF(ISTEXT(VLOOKUP(A1404,'FICHA DE PROJETO'!$A$216:$I$398,2,FALSE)),VLOOKUP(A1404,'FICHA DE PROJETO'!$A$216:$I$398,2,FALSE),\"\")","v":""},null,null,null,null,null,null,null,null,null,{"$f":"IF((B1404=\"\"),\"--\",\"X\")","v":"--"}]
[null,null,"LEI",null,"PROJETO","ATENDEU À LEGISLAÇÃO",null,null,"NÃO ATENDEU À LEGISLAÇÃO",null,null,{"$f":"L1404","v":"--"}]
["Caracterização da Via: ",null,null,null,null,{"$f":"IF(ISBLANK(C1406),\"\",(IF((C1406=E1406),\"X\",\"\")))","v":""},null,null,{"$f":"IF(NOT(C1406=E1406),\"X\",\"\")","v":""},null,null,{"$f":"L1405","v":"--"}]
["Largura da Caixa da Via:",null,null,null,null,{"$f":"IF(ISBLANK(C1407),\"\",(IF((C1407<=E1407),\"X\",\"\")))","v":""},null,null,{"$f":"IF(ISBLANK(C1407),\"\",(IF((C1407>E1407),\"X\",\"\")))","v":""},null,null,{"$f":"L1406","v":"--"}]
["Largura da Pista ",null,null,null,null,{"$f":"IF(ISBLANK(C1408),\"\",(IF((C1408<=E1408),\"X\",\"\")))","v":""},null,null,"",null,null,"--"]
["Largura da calçada",null,null,null,null,"",null,null,"",null,null,"--"]
["Largura do passeio",null,null,null,null,"",null,null,"",null,null,"--"]
["Ciclovia",null,null,null,null,"",null,null,"",null,null,"--"]
["Ciclofaixa",null,null,null,null,"",null,null,"",null,null,"--"]
[null,null,null,null,null,null,null,null,null,null,null,{"$f":"L1412","v":"--"}]
["R14",{"$f":"IF(ISTEXT(VLOOKUP(A1414,'FICHA DE PROJETO'!$A$216:$I$398,2,FALSE)),VLOOKUP(A1414,'FICHA DE PROJETO'!$A$216:$I$398,2,FALSE),\"\")","v":""},null,null,null,null,null,null,null,null,null,{"$f":"IF((B1414=\"\"),\"--\",\"X\")","v":"--"}]
[null,null,"LEI",null,"PROJETO","ATENDEU À LEGISLAÇÃO",null,null,"NÃO ATENDEU À LEGISLAÇÃO",null,null,{"$f":"L1414","v":"--"}]
["Caracterização da Via: ",null,null,null,null,{"$f":"IF(ISBLANK(C1416),\"\",(IF((C1416=E1416),\"X\",\"\")))","v":""},null,null,{"$f":"IF(NOT(C1416=E1416),\"X\",\"\")","v":""},null,null,{"$f":"L1415","v":"--"}]
["Largura da Caixa da Via:",null,null,null,null,{"$f":"IF(ISBLANK(C1417),\"\",(IF((C1417<=E1417),\"X\",\"\")))","v":""},null,null,{"$f":"IF(ISBLANK(C1417),\"\",(IF((C1417>E1417),\"X\",\"\")))","v":""},null,null,{"$f":"L1416","v":"--"}]
["Largura da Pista ",null,null,null,null,{"$f":"IF(ISBLANK(C1418),\"\",(IF((C1418<=E1418),\"X\",\"\")))","v":""},null,null,"",null,null,"--"]
["Largura da calçada",null,null,null,null,"",null,null,"",null,null,"--"]
["Largura do passeio",null,null,null,null,"",null,null,"",null,null,"--"]
["Ciclovia",null,null,null,null,"",null,null,"",null,null,"--"]
["Ciclofaixa",null,null,null,null,"",null,null,"",null,null,"--"]
[null,null,null,null,null,null,null,null,null,null,null,{"$f":"L1422","v":"--"}]
["R15",{"$f":"IF(ISTEXT(VLOOKUP(A1424,'FICHA DE PROJETO'!$A$216:$I$398,2,FALSE)),VLOOKUP(A1424,'FICHA DE PROJETO'!$A$216:$I$398,2,FALSE),\"\")","v":""},null,null,null,null,null,null,null,null,null,{"$f":"IF((B1424=\"\"),\"--\",\"X\")","v":"--"}]
[null,null,"LEI",null,"PROJETO","ATENDEU À LEGISLAÇÃO",null,null,"NÃO ATENDEU À LEGISLAÇÃO",null,null,{"$f":"L1424","v":"--"}]
["Caracterização da Via: ",null,null,null,null,{"$f":"IF(ISBLANK(C1426),\"\",(IF((C1426=E1426),\"X\",\"\")))","v":""},null,null,{"$f":"IF(NOT(C1426=E1426),\"X\",\"\")","v":""},null,null,{"$f":"L1425","v":"--"}]
["Largura da Caixa da Via:",null,null,null,null,{"$f":"IF(ISBLANK(C1427),\"\",(IF((C1427<=E1427),\"X\",\"\")))","v":""},null,null,{"$f":"IF(ISBLANK(C1427),\"\",(IF((C1427>E1427),\"X\",\"\")))","v":""},null,null,{"$f":"L1426","v":"--"}]
["Largura da Pista ",null,null,null,null,{"$f":"IF(ISBLANK(C1428),\"\",(IF((C1428<=E1428),\"X\",\"\")))","v":""},null,null,"",null,null,"--"]
["Largura da calçada",null,null,null,null,"",null,null,"",null,null,"--"]
["Largura do passeio",null,null,null,null,"",null,null,"",null,null,"--"]
["Ciclovia",null,null,null,null,"",null,null,"",null,null,"--"]
["Ciclofaixa",null,null,null,null,"",null,null,"",null,null,"--"]
[null,null,null,null,null,null,null,null,null,null,null,{"$f":"L1432","v":"--"}]
["R16",{"$f":"IF(ISTEXT(VLOOKUP(A1434,'FICHA DE PROJETO'!$A$216:$I$398,2,FALSE)),VLOOKUP(A1434,'FICHA DE PROJETO'!$A$216:$I$398,2,FALSE),\"\")","v":""},null,null,null,null,null,null,null,null,null,{"$f":"IF((B1434=\"\"),\"--\",\"X\")","v":"--"}]
[null,null,"LEI",null,"PROJETO","ATENDEU À LEGISLAÇÃO",null,null,"NÃO ATENDEU À LEGISLAÇÃO",null,null,{"$f":"L1434","v":"--"}]
["Caracterização da Via: ",null,null,null,null,{"$f":"IF(ISBLANK(C1436),\"\",(IF((C1436=E1436),\"X\",\"\")))","v":""},null,null,{"$f":"IF(NOT(C1436=E1436),\"X\",\"\")","v":""},null,null,{"$f":"L1435","v":"--"}]
["Largura da Caixa da Via:",null,null,null,null,{"$f":"IF(ISBLANK(C1437),\"\",(IF((C1437<=E1437),\"X\",\"\")))","v":""},null,null,{"$f":"IF(ISBLANK(C1437),\"\",(IF((C1437>E1437),\"X\",\"\")))","v":""},null,null,{"$f":"L1436","v":"--"}]
["Largura da Pista ",null,null,null,null,{"$f":"IF(ISBLANK(C1438),\"\",(IF((C1438<=E1438),\"X\",\"\")))","v":""},null,null,"",null,null,"--"]
["Largura da calçada",null,null,null,null,"",null,null,"",null,null,"--"]
["Largura do passeio",null,null,null,null,"",null,null,"",null,null,"--"]
["Ciclovia",null,null,null,null,"",null,null,"",null,null,"--"]
["Ciclofaixa",null,null,null,null,"",null,null,"",null,null,"--"]
[null,null,null,null,null,null,null,null,null,null,null,{"$f":"L1442","v":"--"}]
["R17",{"$f":"IF(ISTEXT(VLOOKUP(A1444,'FICHA DE PROJETO'!$A$216:$I$398,2,FALSE)),VLOOKUP(A1444,'FICHA DE PROJETO'!$A$216:$I$398,2,FALSE),\"\")","v":""},null,null,null,null,null,null,null,null,null,{"$f":"IF((B1444=\"\"),\"--\",\"X\")","v":"--"}]
[null,null,"LEI",null,"PROJETO","ATENDEU À LEGISLAÇÃO",null,null,"NÃO ATENDEU À LEGISLAÇÃO",null,null,{"$f":"L1444","v":"--"}]
["Caracterização da Via: ",null,null,null,null,{"$f":"IF(ISBLANK(C1446),\"\",(IF((C1446=E1446),\"X\",\"\")))","v":""},null,null,{"$f":"IF(NOT(C1446=E1446),\"X\",\"\")","v":""},null,null,{"$f":"L1445","v":"--"}]
["Largura da Caixa da Via:",null,null,null,null,{"$f":"IF(ISBLANK(C1447),\"\",(IF((C1447<=E1447),\"X\",\"\")))","v":""},null,null,{"$f":"IF(ISBLANK(C1447),\"\",(IF((C1447>E1447),\"X\",\"\")))","v":""},null,null,{"$f":"L1446","v":"--"}]
["Largura da Pista ",null,null,null,null,{"$f":"IF(ISBLANK(C1448),\"\",(IF((C1448<=E1448),\"X\",\"\")))","v":""},null,null,"",null,null,"--"]
["Largura da calçada",null,null,null,null,"",null,null,"",null,null,"--"]
["Largura do passeio",null,null,null,null,"",null,null,"",null,null,"--"]
["Ciclovia",null,null,null,null,"",null,null,"",null,null,"--"]
["Ciclofaixa",null,null,null,null,"",null,null,"",null,null,"--"]
[null,null,null,null,null,null,null,null,null,null,null,{"$f":"L1452","v":"--"}]
["R18",{"$f":"IF(ISTEXT(VLOOKUP(A1454,'FICHA DE PROJETO'!$A$216:$I$398,2,FALSE)),VLOOKUP(A1454,'FICHA DE PROJETO'!$A$216:$I$398,2,FALSE),\"\")","v":""},null,null,null,null,null,null,null,null,null,{"$f":"IF((B1454=\"\"),\"--\",\"X\")","v":"--"}]
[null,null,"LEI",null,"PROJETO","ATENDEU À LEGISLAÇÃO",null,null,"NÃO ATENDEU À LEGISLAÇÃO",null,null,{"$f":"L1454","v":"--"}]
["Caracterização da Via: ",null,null,null,null,{"$f":"IF(ISBLANK(C1456),\"\",(IF((C1456=E1456),\"X\",\"\")))","v":""},null,null,{"$f":"IF(NOT(C1456=E1456),\"X\",\"\")","v":""},null,null,{"$f":"L1455","v":"--"}]
["Largura da Caixa da Via:",null,null,null,null,{"$f":"IF(ISBLANK(C1457),\"\",(IF((C1457<=E1457),\"X\",\"\")))","v":""},null,null,{"$f":"IF(ISBLANK(C1457),\"\",(IF((C1457>E1457),\"X\",\"\")))","v":""},null,null,{"$f":"L1456","v":"--"}]
["Largura da Pista ",null,null,null,null,{"$f":"IF(ISBLANK(C1458),\"\",(IF((C1458<=E1458),\"X\",\"\")))","v":""},null,null,"",null,null,"--"]
["Largura da calçada",null,null,null,null,"",null,null,"",null,null,"--"]
["Largura do passeio",null,null,null,null,"",null,null,"",null,null,"--"]
["Ciclovia",null,null,null,null,"",null,null,"",null,null,"--"]
["Ciclofaixa",null,null,null,null,"",null,null,"",null,null,"--"]
[null,null,null,null,null,null,null,null,null,null,null,{"$f":"L1462","v":"--"}]
["R19",{"$f":"IF(ISTEXT(VLOOKUP(A1464,'FICHA DE PROJETO'!$A$216:$I$398,2,FALSE)),VLOOKUP(A1464,'FICHA DE PROJETO'!$A$216:$I$398,2,FALSE),\"\")","v":""},null,null,null,null,null,null,null,null,null,{"$f":"IF((B1464=\"\"),\"--\",\"X\")","v":"--"}]
[null,null,"LEI",null,"PROJETO","ATENDEU À LEGISLAÇÃO",null,null,"NÃO ATENDEU À LEGISLAÇÃO",null,null,{"$f":"L1464","v":"--"}]
["Caracterização da Via: ",null,null,null,null,{"$f":"IF(ISBLANK(C1466),\"\",(IF((C1466=E1466),\"X\",\"\")))","v":""},null,null,{"$f":"IF(NOT(C1466=E1466),\"X\",\"\")","v":""},null,null,{"$f":"L1465","v":"--"}]
["Largura da Caixa da Via:",null,null,null,null,{"$f":"IF(ISBLANK(C1467),\"\",(IF((C1467<=E1467),\"X\",\"\")))","v":""},null,null,{"$f":"IF(ISBLANK(C1467),\"\",(IF((C1467>E1467),\"X\",\"\")))","v":""},null,null,{"$f":"L1466","v":"--"}]
["Largura da Pista ",null,null,null,null,{"$f":"IF(ISBLANK(C1468),\"\",(IF((C1468<=E1468),\"X\",\"\")))","v":""},null,null,"",null,null,"--"]
["Largura da calçada",null,null,null,null,"",null,null,"",null,null,"--"]
["Largura do passeio",null,null,null,null,"",null,null,"",null,null,"--"]
["Ciclovia",null,null,null,null,"",null,null,"",null,null,"--"]
["Ciclofaixa",null,null,null,null,"",null,null,"",null,null,"--"]
[null,null,null,null,null,null,null,null,null,null,null,{"$f":"L1472","v":"--"}]
["R20",{"$f":"IF(ISTEXT(VLOOKUP(A1474,'FICHA DE PROJETO'!$A$216:$I$398,2,FALSE)),VLOOKUP(A1474,'FICHA DE PROJETO'!$A$216:$I$398,2,FALSE),\"\")","v":""},null,null,null,null,null,null,null,null,null,{"$f":"IF((B1474=\"\"),\"--\",\"X\")","v":"--"}]
[null,null,"LEI",null,"PROJETO","ATENDEU À LEGISLAÇÃO",null,null,"NÃO ATENDEU À LEGISLAÇÃO",null,null,{"$f":"L1474","v":"--"}]
["Caracterização da Via: ",null,null,null,null,{"$f":"IF(ISBLANK(C1476),\"\",(IF((C1476=E1476),\"X\",\"\")))","v":""},null,null,{"$f":"IF(NOT(C1476=E1476),\"X\",\"\")","v":""},null,null,{"$f":"L1475","v":"--"}]
["Largura da Caixa da Via:",null,null,null,null,{"$f":"IF(ISBLANK(C1477),\"\",(IF((C1477<=E1477),\"X\",\"\")))","v":""},null,null,{"$f":"IF(ISBLANK(C1477),\"\",(IF((C1477>E1477),\"X\",\"\")))","v":""},null,null,{"$f":"L1476","v":"--"}]
["Largura da Pista ",null,null,null,null,{"$f":"IF(ISBLANK(C1478),\"\",(IF((C1478<=E1478),\"X\",\"\")))","v":""},null,null,"",null,null,"--"]
["Largura da calçada",null,null,null,null,"",null,null,"",null,null,"--"]
["Largura do passeio",null,null,null,null,"",null,null,"",null,null,"--"]
["Ciclovia",null,null,null,null,"",null,null,"",null,null,"--"]
["Ciclofaixa",null,null,null,null,"",null,null,"",null,null,"--"]
[null,null,null,null,null,null,null,null,null,null,null,{"$f":"L1482","v":"--"}]
["R21",{"$f":"IF(ISTEXT(VLOOKUP(A1484,'FICHA DE PROJETO'!$A$216:$I$398,2,FALSE)),VLOOKUP(A1484,'FICHA DE PROJETO'!$A$216:$I$398,2,FALSE),\"\")","v":""},null,null,null,null,null,null,null,null,null,{"$f":"IF((B1484=\"\"),\"--\",\"X\")","v":"--"}]
[null,null,"LEI",null,"PROJETO","ATENDEU À LEGISLAÇÃO",null,null,"NÃO ATENDEU À LEGISLAÇÃO",null,null,{"$f":"L1484","v":"--"}]
["Caracterização da Via: ",null,null,null,null,{"$f":"IF(ISBLANK(C1486),\"\",(IF((C1486=E1486),\"X\",\"\")))","v":""},null,null,{"$f":"IF(NOT(C1486=E1486),\"X\",\"\")","v":""},null,null,{"$f":"L1485","v":"--"}]
["Largura da Caixa da Via:",null,null,null,null,{"$f":"IF(ISBLANK(C1487),\"\",(IF((C1487<=E1487),\"X\",\"\")))","v":""},null,null,{"$f":"IF(ISBLANK(C1487),\"\",(IF((C1487>E1487),\"X\",\"\")))","v":""},null,null,{"$f":"L1486","v":"--"}]
["Largura da Pista ",null,null,null,null,{"$f":"IF(ISBLANK(C1488),\"\",(IF((C1488<=E1488),\"X\",\"\")))","v":""},null,null,"",null,null,"--"]
["Largura da calçada",null,null,null,null,"",null,null,"",null,null,"--"]
["Largura do passeio",null,null,null,null,"",null,null,"",null,null,"--"]
["Ciclovia",null,null,null,null,"",null,null,"",null,null,"--"]
["Ciclofaixa",null,null,null,null,"",null,null,"",null,null,"--"]
[null,null,null,null,null,null,null,null,null,null,null,{"$f":"L1492","v":"--"}]
["R22",{"$f":"IF(ISTEXT(VLOOKUP(A1494,'FICHA DE PROJETO'!$A$216:$I$398,2,FALSE)),VLOOKUP(A1494,'FICHA DE PROJETO'!$A$216:$I$398,2,FALSE),\"\")","v":""},null,null,null,null,null,null,null,null,null,{"$f":"IF((B1494=\"\"),\"--\",\"X\")","v":"--"}]
[null,null,"LEI",null,"PROJETO","ATENDEU À LEGISLAÇÃO",null,null,"NÃO ATENDEU À LEGISLAÇÃO",null,null,{"$f":"L1494","v":"--"}]
["Caracterização da Via: ",null,null,null,null,{"$f":"IF(ISBLANK(C1496),\"\",(IF((C1496=E1496),\"X\",\"\")))","v":""},null,null,{"$f":"IF(NOT(C1496=E1496),\"X\",\"\")","v":""},null,null,{"$f":"L1495","v":"--"}]
["Largura da Caixa da Via:",null,null,null,null,{"$f":"IF(ISBLANK(C1497),\"\",(IF((C1497<=E1497),\"X\",\"\")))","v":""},null,null,{"$f":"IF(ISBLANK(C1497),\"\",(IF((C1497>E1497),\"X\",\"\")))","v":""},null,null,{"$f":"L1496","v":"--"}]
["Largura da Pista ",null,null,null,null,{"$f":"IF(ISBLANK(C1498),\"\",(IF((C1498<=E1498),\"X\",\"\")))","v":""},null,null,"",null,null,"--"]
["Largura da calçada",null,null,null,null,"",null,null,"",null,null,"--"]
["Largura do passeio",null,null,null,null,"",null,null,"",null,null,"--"]
["Ciclovia",null,null,null,null,"",null,null,"",null,null,"--"]
["Ciclofaixa",null,null,null,null,"",null,null,"",null,null,"--"]
[null,null,null,null,null,null,null,null,null,null,null,{"$f":"L1502","v":"--"}]
["R23",{"$f":"IF(ISTEXT(VLOOKUP(A1504,'FICHA DE PROJETO'!$A$216:$I$398,2,FALSE)),VLOOKUP(A1504,'FICHA DE PROJETO'!$A$216:$I$398,2,FALSE),\"\")","v":""},null,null,null,null,null,null,null,null,null,{"$f":"IF((B1504=\"\"),\"--\",\"X\")","v":"--"}]
[null,null,"LEI",null,"PROJETO","ATENDEU À LEGISLAÇÃO",null,null,"NÃO ATENDEU À LEGISLAÇÃO",null,null,{"$f":"L1504","v":"--"}]
["Caracterização da Via: ",null,null,null,null,{"$f":"IF(ISBLANK(C1506),\"\",(IF((C1506=E1506),\"X\",\"\")))","v":""},null,null,{"$f":"IF(NOT(C1506=E1506),\"X\",\"\")","v":""},null,null,{"$f":"L1505","v":"--"}]
["Largura da Caixa da Via:",null,null,null,null,{"$f":"IF(ISBLANK(C1507),\"\",(IF((C1507<=E1507),\"X\",\"\")))","v":""},null,null,{"$f":"IF(ISBLANK(C1507),\"\",(IF((C1507>E1507),\"X\",\"\")))","v":""},null,null,{"$f":"L1506","v":"--"}]
["Largura da Pista ",null,null,null,null,{"$f":"IF(ISBLANK(C1508),\"\",(IF((C1508<=E1508),\"X\",\"\")))","v":""},null,null,"",null,null,"--"]
["Largura da calçada",null,null,null,null,"",null,null,"",null,null,"--"]
["Largura do passeio",null,null,null,null,"",null,null,"",null,null,"--"]
["Ciclovia",null,null,null,null,"",null,null,"",null,null,"--"]
["Ciclofaixa",null,null,null,null,"",null,null,"",null,null,"--"]
[null,null,null,null,null,null,null,null,null,null,null,{"$f":"L1512","v":"--"}]
["R24",{"$f":"IF(ISTEXT(VLOOKUP(A1514,'FICHA DE PROJETO'!$A$216:$I$398,2,FALSE)),VLOOKUP(A1514,'FICHA DE PROJETO'!$A$216:$I$398,2,FALSE),\"\")","v":""},null,null,null,null,null,null,null,null,null,{"$f":"IF((B1514=\"\"),\"--\",\"X\")","v":"--"}]
[null,null,"LEI",null,"PROJETO","ATENDEU À LEGISLAÇÃO",null,null,"NÃO ATENDEU À LEGISLAÇÃO",null,null,{"$f":"L1514","v":"--"}]
["Caracterização da Via: ",null,null,null,null,{"$f":"IF(ISBLANK(C1516),\"\",(IF((C1516=E1516),\"X\",\"\")))","v":""},null,null,{"$f":"IF(NOT(C1516=E1516),\"X\",\"\")","v":""},null,null,{"$f":"L1515","v":"--"}]
["Largura da Caixa da Via:",null,null,null,null,{"$f":"IF(ISBLANK(C1517),\"\",(IF((C1517<=E1517),\"X\",\"\")))","v":""},null,null,{"$f":"IF(ISBLANK(C1517),\"\",(IF((C1517>E1517),\"X\",\"\")))","v":""},null,null,{"$f":"L1516","v":"--"}]
["Largura da Pista ",null,null,null,null,{"$f":"IF(ISBLANK(C1518),\"\",(IF((C1518<=E1518),\"X\",\"\")))","v":""},null,null,"",null,null,"--"]
["Largura da calçada",null,null,null,null,"",null,null,"",null,null,"--"]
["Largura do passeio",null,null,null,null,"",null,null,"",null,null,"--"]
["Ciclovia",null,null,null,null,"",null,null,"",null,null,"--"]
["Ciclofaixa",null,null,null,null,"",null,null,"",null,null,"--"]
[null,null,null,null,null,null,null,null,null,null,null,{"$f":"L1522","v":"--"}]
["R25",{"$f":"IF(ISTEXT(VLOOKUP(A1524,'FICHA DE PROJETO'!$A$216:$I$398,2,FALSE)),VLOOKUP(A1524,'FICHA DE PROJETO'!$A$216:$I$398,2,FALSE),\"\")","v":""},null,null,null,null,null,null,null,null,null,{"$f":"IF((B1524=\"\"),\"--\",\"X\")","v":"--"}]
[null,null,"LEI",null,"PROJETO","ATENDEU À LEGISLAÇÃO",null,null,"NÃO ATENDEU À LEGISLAÇÃO",null,null,{"$f":"L1524","v":"--"}]
["Caracterização da Via: ",null,null,null,null,{"$f":"IF(ISBLANK(C1526),\"\",(IF((C1526=E1526),\"X\",\"\")))","v":""},null,null,{"$f":"IF(NOT(C1526=E1526),\"X\",\"\")","v":""},null,null,{"$f":"L1525","v":"--"}]
["Largura da Caixa da Via:",null,null,null,null,{"$f":"IF(ISBLANK(C1527),\"\",(IF((C1527<=E1527),\"X\",\"\")))","v":""},null,null,{"$f":"IF(ISBLANK(C1527),\"\",(IF((C1527>E1527),\"X\",\"\")))","v":""},null,null,"--"]
["Largura da Pista ",null,null,null,null,{"$f":"IF(ISBLANK(C1528),\"\",(IF((C1528<=E1528),\"X\",\"\")))","v":""},null,null,"",null,null,"--"]
["Largura da calçada",null,null,null,null,"",null,null,"",null,null,"--"]
["Largura do passeio",null,null,null,null,"",null,null,"",null,null,"--"]
["Ciclovia",null,null,null,null,"",null,null,"",null,null,"--"]
["Ciclofaixa",null,null,null,null,"",null,null,"",null,null,"--"]
[null,null,null,null,null,null,null,null,null,null,null,"--"]
["R26",{"$f":"IF(ISTEXT(VLOOKUP(A1534,'FICHA DE PROJETO'!$A$216:$I$398,2,FALSE)),VLOOKUP(A1534,'FICHA DE PROJETO'!$A$216:$I$398,2,FALSE),\"\")","v":""},null,null,null,null,null,null,null,null,null,{"$f":"IF((B1534=\"\"),\"--\",\"X\")","v":"--"}]
[null,null,"LEI",null,"PROJETO","ATENDEU À LEGISLAÇÃO",null,null,"NÃO ATENDEU À LEGISLAÇÃO",null,null,{"$f":"L1534","v":"--"}]
["Caracterização da Via: ",null,null,null,null,{"$f":"IF(ISBLANK(C1536),\"\",(IF((C1536=E1536),\"X\",\"\")))","v":""},null,null,{"$f":"IF(NOT(C1536=E1536),\"X\",\"\")","v":""},null,null,{"$f":"L1535","v":"--"}]
["Largura da Caixa da Via:",null,null,null,null,{"$f":"IF(ISBLANK(C1537),\"\",(IF((C1537<=E1537),\"X\",\"\")))","v":""},null,null,{"$f":"IF(ISBLANK(C1537),\"\",(IF((C1537>E1537),\"X\",\"\")))","v":""},null,null,"--"]
["Largura da Pista ",null,null,null,null,{"$f":"IF(ISBLANK(C1538),\"\",(IF((C1538<=E1538),\"X\",\"\")))","v":""},null,null,"",null,null,"--"]
["Largura da calçada",null,null,null,null,"",null,null,"",null,null,"--"]
["Largura do passeio",null,null,null,null,"",null,null,"",null,null,"--"]
["Ciclovia",null,null,null,null,"",null,null,"",null,null,"--"]
["Ciclofaixa",null,null,null,null,"",null,null,"",null,null,"--"]
[null,null,null,null,null,null,null,null,null,null,null,"--"]
["R27",{"$f":"IF(ISTEXT(VLOOKUP(A1544,'FICHA DE PROJETO'!$A$216:$I$398,2,FALSE)),VLOOKUP(A1544,'FICHA DE PROJETO'!$A$216:$I$398,2,FALSE),\"\")","v":""},null,null,null,null,null,null,null,null,null,{"$f":"IF((B1544=\"\"),\"--\",\"X\")","v":"--"}]
[null,null,"LEI",null,"PROJETO","ATENDEU À LEGISLAÇÃO",null,null,"NÃO ATENDEU À LEGISLAÇÃO",null,null,{"$f":"L1544","v":"--"}]
["Caracterização da Via: ",null,null,null,null,{"$f":"IF(ISBLANK(C1546),\"\",(IF((C1546=E1546),\"X\",\"\")))","v":""},null,null,{"$f":"IF(NOT(C1546=E1546),\"X\",\"\")","v":""},null,null,{"$f":"L1545","v":"--"}]
["Largura da Caixa da Via:",null,null,null,null,{"$f":"IF(ISBLANK(C1547),\"\",(IF((C1547<=E1547),\"X\",\"\")))","v":""},null,null,{"$f":"IF(ISBLANK(C1547),\"\",(IF((C1547>E1547),\"X\",\"\")))","v":""},null,null,"--"]
["Largura da Pista ",null,null,null,null,{"$f":"IF(ISBLANK(C1548),\"\",(IF((C1548<=E1548),\"X\",\"\")))","v":""},null,null,"",null,null,"--"]
["Largura da calçada",null,null,null,null,"",null,null,"",null,null,"--"]
["Largura do passeio",null,null,null,null,"",null,null,"",null,null,"--"]
["Ciclovia",null,null,null,null,"",null,null,"",null,null,"--"]
["Ciclofaixa",null,null,null,null,"",null,null,"",null,null,"--"]
[null,null,null,null,null,null,null,null,null,null,null,"--"]
["R28",{"$f":"IF(ISTEXT(VLOOKUP(A1554,'FICHA DE PROJETO'!$A$216:$I$398,2,FALSE)),VLOOKUP(A1554,'FICHA DE PROJETO'!$A$216:$I$398,2,FALSE),\"\")","v":""},null,null,null,null,null,null,null,null,null,{"$f":"IF((B1554=\"\"),\"--\",\"X\")","v":"--"}]
[null,null,"LEI",null,"PROJETO","ATENDEU À LEGISLAÇÃO",null,null,"NÃO ATENDEU À LEGISLAÇÃO",null,null,{"$f":"L1554","v":"--"}]
["Caracterização da Via: ",null,null,null,null,{"$f":"IF(ISBLANK(C1556),\"\",(IF((C1556=E1556),\"X\",\"\")))","v":""},null,null,{"$f":"IF(NOT(C1556=E1556),\"X\",\"\")","v":""},null,null,{"$f":"L1555","v":"--"}]
["Largura da Caixa da Via:",null,null,null,null,{"$f":"IF(ISBLANK(C1557),\"\",(IF((C1557<=E1557),\"X\",\"\")))","v":""},null,null,{"$f":"IF(ISBLANK(C1557),\"\",(IF((C1557>E1557),\"X\",\"\")))","v":""},null,null,"--"]
["Largura da Pista ",null,null,null,null,{"$f":"IF(ISBLANK(C1558),\"\",(IF((C1558<=E1558),\"X\",\"\")))","v":""},null,null,"",null,null,"--"]
["Largura da calçada",null,null,null,null,"",null,null,"",null,null,"--"]
["Largura do passeio",null,null,null,null,"",null,null,"",null,null,"--"]
["Ciclovia",null,null,null,null,"",null,null,"",null,null,"--"]
["Ciclofaixa",null,null,null,null,"",null,null,"",null,null,"--"]
[null,null,null,null,null,null,null,null,null,null,null,"--"]
["R29",{"$f":"IF(ISTEXT(VLOOKUP(A1564,'FICHA DE PROJETO'!$A$216:$I$398,2,FALSE)),VLOOKUP(A1564,'FICHA DE PROJETO'!$A$216:$I$398,2,FALSE),\"\")","v":""},null,null,null,null,null,null,null,null,null,{"$f":"IF((B1564=\"\"),\"--\",\"X\")","v":"--"}]
[null,null,"LEI",null,"PROJETO","ATENDEU À LEGISLAÇÃO",null,null,"NÃO ATENDEU À LEGISLAÇÃO",null,null,{"$f":"L1564","v":"--"}]
["Caracterização da Via: ",null,null,null,null,{"$f":"IF(ISBLANK(C1566),\"\",(IF((C1566=E1566),\"X\",\"\")))","v":""},null,null,{"$f":"IF(NOT(C1566=E1566),\"X\",\"\")","v":""},null,null,{"$f":"L1565","v":"--"}]
["Largura da Caixa da Via:",null,null,null,null,{"$f":"IF(ISBLANK(C1567),\"\",(IF((C1567<=E1567),\"X\",\"\")))","v":""},null,null,{"$f":"IF(ISBLANK(C1567),\"\",(IF((C1567>E1567),\"X\",\"\")))","v":""},null,null,"--"]
["Largura da Pista ",null,null,null,null,{"$f":"IF(ISBLANK(C1568),\"\",(IF((C1568<=E1568),\"X\",\"\")))","v":""},null,null,"",null,null,"--"]
["Largura da calçada",null,null,null,null,"",null,null,"",null,null,"--"]
["Largura do passeio",null,null,null,null,"",null,null,"",null,null,"--"]
["Ciclovia",null,null,null,null,"",null,null,"",null,null,"--"]
["Ciclofaixa",null,null,null,null,"",null,null,"",null,null,"--"]
[null,null,null,null,null,null,null,null,null,null,null,"--"]
["R30",{"$f":"IF(ISTEXT(VLOOKUP(A1574,'FICHA DE PROJETO'!$A$216:$I$398,2,FALSE)),VLOOKUP(A1574,'FICHA DE PROJETO'!$A$216:$I$398,2,FALSE),\"\")","v":""},null,null,null,null,null,null,null,null,null,{"$f":"IF((B1574=\"\"),\"--\",\"X\")","v":"--"}]
[null,null,"LEI",null,"PROJETO","ATENDEU À LEGISLAÇÃO",null,null,"NÃO ATENDEU À LEGISLAÇÃO",null,null,{"$f":"L1574","v":"--"}]
["Caracterização da Via: ",null,null,null,null,{"$f":"IF(ISBLANK(C1576),\"\",(IF((C1576=E1576),\"X\",\"\")))","v":""},null,null,{"$f":"IF(NOT(C1576=E1576),\"X\",\"\")","v":""},null,null,{"$f":"L1575","v":"--"}]
["Largura da Caixa da Via:",null,null,null,null,{"$f":"IF(ISBLANK(C1577),\"\",(IF((C1577<=E1577),\"X\",\"\")))","v":""},null,null,{"$f":"IF(ISBLANK(C1577),\"\",(IF((C1577>E1577),\"X\",\"\")))","v":""},null,null,"--"]
["Largura da Pista ",null,null,null,null,{"$f":"IF(ISBLANK(C1578),\"\",(IF((C1578<=E1578),\"X\",\"\")))","v":""},null,null,"",null,null,"--"]
["Largura da calçada",null,null,null,null,"",null,null,"",null,null,"--"]
["Largura do passeio",null,null,null,null,"",null,null,"",null,null,"--"]
["Ciclovia",null,null,null,null,"",null,null,"",null,null,"--"]
["Ciclofaixa",null,null,null,null,"",null,null,"",null,null,"--"]
[null,null,null,null,null,null,null,null,null,null,null,"--"]
["R31",{"$f":"IF(ISTEXT(VLOOKUP(A1584,'FICHA DE PROJETO'!$A$216:$I$398,2,FALSE)),VLOOKUP(A1584,'FICHA DE PROJETO'!$A$216:$I$398,2,FALSE),\"\")","v":""},null,null,null,null,null,null,null,null,null,{"$f":"IF((B1584=\"\"),\"--\",\"X\")","v":"--"}]
[null,null,"LEI",null,"PROJETO","ATENDEU À LEGISLAÇÃO",null,null,"NÃO ATENDEU À LEGISLAÇÃO",null,null,{"$f":"L1584","v":"--"}]
["Caracterização da Via: ",null,null,null,null,{"$f":"IF(ISBLANK(C1586),\"\",(IF((C1586=E1586),\"X\",\"\")))","v":""},null,null,{"$f":"IF(NOT(C1586=E1586),\"X\",\"\")","v":""},null,null,{"$f":"L1585","v":"--"}]
["Largura da Caixa da Via:",null,null,null,null,{"$f":"IF(ISBLANK(C1587),\"\",(IF((C1587<=E1587),\"X\",\"\")))","v":""},null,null,{"$f":"IF(ISBLANK(C1587),\"\",(IF((C1587>E1587),\"X\",\"\")))","v":""},null,null,"--"]
["Largura da Pista ",null,null,null,null,{"$f":"IF(ISBLANK(C1588),\"\",(IF((C1588<=E1588),\"X\",\"\")))","v":""},null,null,"",null,null,"--"]
["Largura da calçada",null,null,null,null,"",null,null,"",null,null,"--"]
["Largura do passeio",null,null,null,null,"",null,null,"",null,null,"--"]
["Ciclovia",null,null,null,null,"",null,null,"",null,null,"--"]
["Ciclofaixa",null,null,null,null,"",null,null,"",null,null,"--"]
[null,null,null,null,null,null,null,null,null,null,null,"--"]
["R32",{"$f":"IF(ISTEXT(VLOOKUP(A1594,'FICHA DE PROJETO'!$A$216:$I$398,2,FALSE)),VLOOKUP(A1594,'FICHA DE PROJETO'!$A$216:$I$398,2,FALSE),\"\")","v":""},null,null,null,null,null,null,null,null,null,{"$f":"IF((B1594=\"\"),\"--\",\"X\")","v":"--"}]
[null,null,"LEI",null,"PROJETO","ATENDEU À LEGISLAÇÃO",null,null,"NÃO ATENDEU À LEGISLAÇÃO",null,null,{"$f":"L1594","v":"--"}]
["Caracterização da Via: ",null,null,null,null,{"$f":"IF(ISBLANK(C1596),\"\",(IF((C1596=E1596),\"X\",\"\")))","v":""},null,null,{"$f":"IF(NOT(C1596=E1596),\"X\",\"\")","v":""},null,null,{"$f":"L1595","v":"--"}]
["Largura da Caixa da Via:",null,null,null,null,{"$f":"IF(ISBLANK(C1597),\"\",(IF((C1597<=E1597),\"X\",\"\")))","v":""},null,null,{"$f":"IF(ISBLANK(C1597),\"\",(IF((C1597>E1597),\"X\",\"\")))","v":""},null,null,"--"]
["Largura da Pista ",null,null,null,null,{"$f":"IF(ISBLANK(C1598),\"\",(IF((C1598<=E1598),\"X\",\"\")))","v":""},null,null,"",null,null,"--"]
["Largura da calçada",null,null,null,null,"",null,null,"",null,null,"--"]
["Largura do passeio",null,null,null,null,"",null,null,"",null,null,"--"]
["Ciclovia",null,null,null,null,"",null,null,"",null,null,"--"]
["Ciclofaixa",null,null,null,null,"",null,null,"",null,null,"--"]
[null,null,null,null,null,null,null,null,null,null,null,"--"]
["R33",{"$f":"IF(ISTEXT(VLOOKUP(A1604,'FICHA DE PROJETO'!$A$216:$I$398,2,FALSE)),VLOOKUP(A1604,'FICHA DE PROJETO'!$A$216:$I$398,2,FALSE),\"\")","v":""},null,null,null,null,null,null,null,null,null,{"$f":"IF((B1604=\"\"),\"--\",\"X\")","v":"--"}]
[null,null,"LEI",null,"PROJETO","ATENDEU À LEGISLAÇÃO",null,null,"NÃO ATENDEU À LEGISLAÇÃO",null,null,{"$f":"L1604","v":"--"}]
["Caracterização da Via: ",null,null,null,null,{"$f":"IF(ISBLANK(C1606),\"\",(IF((C1606=E1606),\"X\",\"\")))","v":""},null,null,{"$f":"IF(NOT(C1606=E1606),\"X\",\"\")","v":""},null,null,{"$f":"L1605","v":"--"}]
["Largura da Caixa da Via:",null,null,null,null,{"$f":"IF(ISBLANK(C1607),\"\",(IF((C1607<=E1607),\"X\",\"\")))","v":""},null,null,{"$f":"IF(ISBLANK(C1607),\"\",(IF((C1607>E1607),\"X\",\"\")))","v":""},null,null,"--"]
["Largura da Pista ",null,null,null,null,{"$f":"IF(ISBLANK(C1608),\"\",(IF((C1608<=E1608),\"X\",\"\")))","v":""},null,null,"",null,null,"--"]
["Largura da calçada",null,null,null,null,"",null,null,"",null,null,"--"]
["Largura do passeio",null,null,null,null,"",null,null,"",null,null,"--"]
["Ciclovia",null,null,null,null,"",null,null,"",null,null,"--"]
["Ciclofaixa",null,null,null,null,"",null,null,"",null,null,"--"]
[null,null,null,null,null,null,null,null,null,null,null,"--"]
["R34",{"$f":"IF(ISTEXT(VLOOKUP(A1614,'FICHA DE PROJETO'!$A$216:$I$398,2,FALSE)),VLOOKUP(A1614,'FICHA DE PROJETO'!$A$216:$I$398,2,FALSE),\"\")","v":""},null,null,null,null,null,null,null,null,null,{"$f":"IF((B1614=\"\"),\"--\",\"X\")","v":"--"}]
[null,null,"LEI",null,"PROJETO","ATENDEU À LEGISLAÇÃO",null,null,"NÃO ATENDEU À LEGISLAÇÃO",null,null,{"$f":"L1614","v":"--"}]
["Caracterização da Via: ",null,null,null,null,{"$f":"IF(ISBLANK(C1616),\"\",(IF((C1616=E1616),\"X\",\"\")))","v":""},null,null,{"$f":"IF(NOT(C1616=E1616),\"X\",\"\")","v":""},null,null,{"$f":"L1615","v":"--"}]
["Largura da Caixa da Via:",null,null,null,null,{"$f":"IF(ISBLANK(C1617),\"\",(IF((C1617<=E1617),\"X\",\"\")))","v":""},null,null,{"$f":"IF(ISBLANK(C1617),\"\",(IF((C1617>E1617),\"X\",\"\")))","v":""},null,null,"--"]
["Largura da Pista ",null,null,null,null,{"$f":"IF(ISBLANK(C1618),\"\",(IF((C1618<=E1618),\"X\",\"\")))","v":""},null,null,"",null,null,"--"]
["Largura da calçada",null,null,null,null,"",null,null,"",null,null,"--"]
["Largura do passeio",null,null,null,null,"",null,null,"",null,null,"--"]
["Ciclovia",null,null,null,null,"",null,null,"",null,null,"--"]
["Ciclofaixa",null,null,null,null,"",null,null,"",null,null,"--"]
[null,null,null,null,null,null,null,null,null,null,null,"--"]
["R35",{"$f":"IF(ISTEXT(VLOOKUP(A1624,'FICHA DE PROJETO'!$A$216:$I$398,2,FALSE)),VLOOKUP(A1624,'FICHA DE PROJETO'!$A$216:$I$398,2,FALSE),\"\")","v":""},null,null,null,null,null,null,null,null,null,{"$f":"IF((B1624=\"\"),\"--\",\"X\")","v":"--"}]
[null,null,"LEI",null,"PROJETO","ATENDEU À LEGISLAÇÃO",null,null,"NÃO ATENDEU À LEGISLAÇÃO",null,null,{"$f":"L1624","v":"--"}]
["Caracterização da Via: ",null,null,null,null,{"$f":"IF(ISBLANK(C1626),\"\",(IF((C1626=E1626),\"X\",\"\")))","v":""},null,null,{"$f":"IF(NOT(C1626=E1626),\"X\",\"\")","v":""},null,null,{"$f":"L1625","v":"--"}]
["Largura da Caixa da Via:",null,null,null,null,{"$f":"IF(ISBLANK(C1627),\"\",(IF((C1627<=E1627),\"X\",\"\")))","v":""},null,null,{"$f":"IF(ISBLANK(C1627),\"\",(IF((C1627>E1627),\"X\",\"\")))","v":""},null,null,"--"]
["Largura da Pista ",null,null,null,null,{"$f":"IF(ISBLANK(C1628),\"\",(IF((C1628<=E1628),\"X\",\"\")))","v":""},null,null,"",null,null,"--"]
["Largura da calçada",null,null,null,null,"",null,null,"",null,null,"--"]
["Largura do passeio",null,null,null,null,"",null,null,"",null,null,"--"]
["Ciclovia",null,null,null,null,"",null,null,"",null,null,"--"]
["Ciclofaixa",null,null,null,null,"",null,null,"",null,null,"--"]
[null,null,null,null,null,null,null,null,null,null,null,"--"]
["R36",{"$f":"IF(ISTEXT(VLOOKUP(A1634,'FICHA DE PROJETO'!$A$216:$I$398,2,FALSE)),VLOOKUP(A1634,'FICHA DE PROJETO'!$A$216:$I$398,2,FALSE),\"\")","v":""},null,null,null,null,null,null,null,null,null,{"$f":"IF((B1634=\"\"),\"--\",\"X\")","v":"--"}]
[null,null,"LEI",null,"PROJETO","ATENDEU À LEGISLAÇÃO",null,null,"NÃO ATENDEU À LEGISLAÇÃO",null,null,{"$f":"L1634","v":"--"}]
["Caracterização da Via: ",null,null,null,null,{"$f":"IF(ISBLANK(C1636),\"\",(IF((C1636=E1636),\"X\",\"\")))","v":""},null,null,{"$f":"IF(NOT(C1636=E1636),\"X\",\"\")","v":""},null,null,{"$f":"L1635","v":"--"}]
["Largura da Caixa da Via:",null,null,null,null,{"$f":"IF(ISBLANK(C1637),\"\",(IF((C1637<=E1637),\"X\",\"\")))","v":""},null,null,{"$f":"IF(ISBLANK(C1637),\"\",(IF((C1637>E1637),\"X\",\"\")))","v":""},null,null,"--"]
["Largura da Pista ",null,null,null,null,{"$f":"IF(ISBLANK(C1638),\"\",(IF((C1638<=E1638),\"X\",\"\")))","v":""},null,null,"",null,null,"--"]
["Largura da calçada",null,null,null,null,"",null,null,"",null,null,"--"]
["Largura do passeio",null,null,null,null,"",null,null,"",null,null,"--"]
["Ciclovia",null,null,null,null,"",null,null,"",null,null,"--"]
["Ciclofaixa",null,null,null,null,"",null,null,"",null,null,"--"]
[null,null,null,null,null,null,null,null,null,null,null,"--"]
["R37",{"$f":"IF(ISTEXT(VLOOKUP(A1644,'FICHA DE PROJETO'!$A$216:$I$398,2,FALSE)),VLOOKUP(A1644,'FICHA DE PROJETO'!$A$216:$I$398,2,FALSE),\"\")","v":""},null,null,null,null,null,null,null,null,null,{"$f":"IF((B1644=\"\"),\"--\",\"X\")","v":"--"}]
[null,null,"LEI",null,"PROJETO","ATENDEU À LEGISLAÇÃO",null,null,"NÃO ATENDEU À LEGISLAÇÃO",null,null,{"$f":"L1644","v":"--"}]
["Caracterização da Via: ",null,null,null,null,{"$f":"IF(ISBLANK(C1646),\"\",(IF((C1646=E1646),\"X\",\"\")))","v":""},null,null,{"$f":"IF(NOT(C1646=E1646),\"X\",\"\")","v":""},null,null,{"$f":"L1645","v":"--"}]
["Largura da Caixa da Via:",null,null,null,null,{"$f":"IF(ISBLANK(C1647),\"\",(IF((C1647<=E1647),\"X\",\"\")))","v":""},null,null,{"$f":"IF(ISBLANK(C1647),\"\",(IF((C1647>E1647),\"X\",\"\")))","v":""},null,null,"--"]
["Largura da Pista ",null,null,null,null,{"$f":"IF(ISBLANK(C1648),\"\",(IF((C1648<=E1648),\"X\",\"\")))","v":""},null,null,"",null,null,"--"]
["Largura da calçada",null,null,null,null,"",null,null,"",null,null,"--"]
["Largura do passeio",null,null,null,null,"",null,null,"",null,null,"--"]
["Ciclovia",null,null,null,null,"",null,null,"",null,null,"--"]
["Ciclofaixa",null,null,null,null,"",null,null,"",null,null,"--"]
[null,null,null,null,null,null,null,null,null,null,null,"--"]
["R38",{"$f":"IF(ISTEXT(VLOOKUP(A1654,'FICHA DE PROJETO'!$A$216:$I$398,2,FALSE)),VLOOKUP(A1654,'FICHA DE PROJETO'!$A$216:$I$398,2,FALSE),\"\")","v":""},null,null,null,null,null,null,null,null,null,{"$f":"IF((B1654=\"\"),\"--\",\"X\")","v":"--"}]
[null,null,"LEI",null,"PROJETO","ATENDEU À LEGISLAÇÃO",null,null,"NÃO ATENDEU À LEGISLAÇÃO",null,null,{"$f":"L1654","v":"--"}]
["Caracterização da Via: ",null,null,null,null,{"$f":"IF(ISBLANK(C1656),\"\",(IF((C1656=E1656),\"X\",\"\")))","v":""},null,null,{"$f":"IF(NOT(C1656=E1656),\"X\",\"\")","v":""},null,null,{"$f":"L1655","v":"--"}]
["Largura da Caixa da Via:",null,null,null,null,{"$f":"IF(ISBLANK(C1657),\"\",(IF((C1657<=E1657),\"X\",\"\")))","v":""},null,null,{"$f":"IF(ISBLANK(C1657),\"\",(IF((C1657>E1657),\"X\",\"\")))","v":""},null,null,"--"]
["Largura da Pista ",null,null,null,null,{"$f":"IF(ISBLANK(C1658),\"\",(IF((C1658<=E1658),\"X\",\"\")))","v":""},null,null,"",null,null,"--"]
["Largura da calçada",null,null,null,null,"",null,null,"",null,null,"--"]
["Largura do passeio",null,null,null,null,"",null,null,"",null,null,"--"]
["Ciclovia",null,null,null,null,"",null,null,"",null,null,"--"]
["Ciclofaixa",null,null,null,null,"",null,null,"",null,null,"--"]
[null,null,null,null,null,null,null,null,null,null,null,"--"]
["R39",{"$f":"IF(ISTEXT(VLOOKUP(A1664,'FICHA DE PROJETO'!$A$216:$I$398,2,FALSE)),VLOOKUP(A1664,'FICHA DE PROJETO'!$A$216:$I$398,2,FALSE),\"\")","v":""},null,null,null,null,null,null,null,null,null,{"$f":"IF((B1664=\"\"),\"--\",\"X\")","v":"--"}]
[null,null,"LEI",null,"PROJETO","ATENDEU À LEGISLAÇÃO",null,null,"NÃO ATENDEU À LEGISLAÇÃO",null,null,{"$f":"L1664","v":"--"}]
["Caracterização da Via: ",null,null,null,null,{"$f":"IF(ISBLANK(C1666),\"\",(IF((C1666=E1666),\"X\",\"\")))","v":""},null,null,{"$f":"IF(NOT(C1666=E1666),\"X\",\"\")","v":""},null,null,{"$f":"L1665","v":"--"}]
["Largura da Caixa da Via:",null,null,null,null,{"$f":"IF(ISBLANK(C1667),\"\",(IF((C1667<=E1667),\"X\",\"\")))","v":""},null,null,{"$f":"IF(ISBLANK(C1667),\"\",(IF((C1667>E1667),\"X\",\"\")))","v":""},null,null,"--"]
["Largura da Pista ",null,null,null,null,{"$f":"IF(ISBLANK(C1668),\"\",(IF((C1668<=E1668),\"X\",\"\")))","v":""},null,null,"",null,null,"--"]
["Largura da calçada",null,null,null,null,"",null,null,"",null,null,"--"]
["Largura do passeio",null,null,null,null,"",null,null,"",null,null,"--"]
["Ciclovia",null,null,null,null,"",null,null,"",null,null,"--"]
["Ciclofaixa",null,null,null,null,"",null,null,"",null,null,"--"]
[null,null,null,null,null,null,null,null,null,null,null,"--"]
["R40",{"$f":"IF(ISTEXT(VLOOKUP(A1674,'FICHA DE PROJETO'!$A$216:$I$398,2,FALSE)),VLOOKUP(A1674,'FICHA DE PROJETO'!$A$216:$I$398,2,FALSE),\"\")","v":""},null,null,null,null,null,null,null,null,null,{"$f":"IF((B1674=\"\"),\"--\",\"X\")","v":"--"}]
[null,null,"LEI",null,"PROJETO","ATENDEU À LEGISLAÇÃO",null,null,"NÃO ATENDEU À LEGISLAÇÃO",null,null,{"$f":"L1674","v":"--"}]
["Caracterização da Via: ",null,null,null,null,{"$f":"IF(ISBLANK(C1676),\"\",(IF((C1676=E1676),\"X\",\"\")))","v":""},null,null,{"$f":"IF(NOT(C1676=E1676),\"X\",\"\")","v":""},null,null,{"$f":"L1675","v":"--"}]
["Largura da Caixa da Via:",null,null,null,null,{"$f":"IF(ISBLANK(C1677),\"\",(IF((C1677<=E1677),\"X\",\"\")))","v":""},null,null,{"$f":"IF(ISBLANK(C1677),\"\",(IF((C1677>E1677),\"X\",\"\")))","v":""},null,null,"--"]
["Largura da Pista ",null,null,null,null,{"$f":"IF(ISBLANK(C1678),\"\",(IF((C1678<=E1678),\"X\",\"\")))","v":""},null,null,"",null,null,"--"]
["Largura da calçada",null,null,null,null,"",null,null,"",null,null,"--"]
["Largura do passeio",null,null,null,null,"",null,null,"",null,null,"--"]
["Ciclovia",null,null,null,null,"",null,null,"",null,null,"--"]
["Ciclofaixa",null,null,null,null,"",null,null,"",null,null,"--"]
[null,null,null,null,null,null,null,null,null,null,null,"--"]
["R41",{"$f":"IF(ISTEXT(VLOOKUP(A1684,'FICHA DE PROJETO'!$A$216:$I$398,2,FALSE)),VLOOKUP(A1684,'FICHA DE PROJETO'!$A$216:$I$398,2,FALSE),\"\")","v":""},null,null,null,null,null,null,null,null,null,{"$f":"IF((B1684=\"\"),\"--\",\"X\")","v":"--"}]
[null,null,"LEI",null,"PROJETO","ATENDEU À LEGISLAÇÃO",null,null,"NÃO ATENDEU À LEGISLAÇÃO",null,null,{"$f":"L1684","v":"--"}]
["Caracterização da Via: ",null,null,null,null,{"$f":"IF(ISBLANK(C1686),\"\",(IF((C1686=E1686),\"X\",\"\")))","v":""},null,null,{"$f":"IF(NOT(C1686=E1686),\"X\",\"\")","v":""},null,null,{"$f":"L1685","v":"--"}]
["Largura da Caixa da Via:",null,null,null,null,{"$f":"IF(ISBLANK(C1687),\"\",(IF((C1687<=E1687),\"X\",\"\")))","v":""},null,null,{"$f":"IF(ISBLANK(C1687),\"\",(IF((C1687>E1687),\"X\",\"\")))","v":""},null,null,"--"]
["Largura da Pista ",null,null,null,null,{"$f":"IF(ISBLANK(C1688),\"\",(IF((C1688<=E1688),\"X\",\"\")))","v":""},null,null,"",null,null,"--"]
["Largura da calçada",null,null,null,null,"",null,null,"",null,null,"--"]
["Largura do passeio",null,null,null,null,"",null,null,"",null,null,"--"]
["Ciclovia",null,null,null,null,"",null,null,"",null,null,"--"]
["Ciclofaixa",null,null,null,null,"",null,null,"",null,null,"--"]
[null,null,null,null,null,null,null,null,null,null,null,"--"]
["R42",{"$f":"IF(ISTEXT(VLOOKUP(A1694,'FICHA DE PROJETO'!$A$216:$I$398,2,FALSE)),VLOOKUP(A1694,'FICHA DE PROJETO'!$A$216:$I$398,2,FALSE),\"\")","v":""},null,null,null,null,null,null,null,null,null,{"$f":"IF((B1694=\"\"),\"--\",\"X\")","v":"--"}]
[null,null,"LEI",null,"PROJETO","ATENDEU À LEGISLAÇÃO",null,null,"NÃO ATENDEU À LEGISLAÇÃO",null,null,{"$f":"L1694","v":"--"}]
["Caracterização da Via: ",null,null,null,null,{"$f":"IF(ISBLANK(C1696),\"\",(IF((C1696=E1696),\"X\",\"\")))","v":""},null,null,{"$f":"IF(NOT(C1696=E1696),\"X\",\"\")","v":""},null,null,{"$f":"L1695","v":"--"}]
["Largura da Caixa da Via:",null,null,null,null,{"$f":"IF(ISBLANK(C1697),\"\",(IF((C1697<=E1697),\"X\",\"\")))","v":""},null,null,{"$f":"IF(ISBLANK(C1697),\"\",(IF((C1697>E1697),\"X\",\"\")))","v":""},null,null,"--"]
["Largura da Pista ",null,null,null,null,{"$f":"IF(ISBLANK(C1698),\"\",(IF((C1698<=E1698),\"X\",\"\")))","v":""},null,null,"",null,null,"--"]
["Largura da calçada",null,null,null,null,"",null,null,"",null,null,"--"]
["Largura do passeio",null,null,null,null,"",null,null,"",null,null,"--"]
["Ciclovia",null,null,null,null,"",null,null,"",null,null,"--"]
["Ciclofaixa",null,null,null,null,"",null,null,"",null,null,"--"]
[null,null,null,null,null,null,null,null,null,null,null,"--"]
["R43",{"$f":"IF(ISTEXT(VLOOKUP(A1704,'FICHA DE PROJETO'!$A$216:$I$398,2,FALSE)),VLOOKUP(A1704,'FICHA DE PROJETO'!$A$216:$I$398,2,FALSE),\"\")","v":""},null,null,null,null,null,null,null,null,null,{"$f":"IF((B1704=\"\"),\"--\",\"X\")","v":"--"}]
[null,null,"LEI",null,"PROJETO","ATENDEU À LEGISLAÇÃO",null,null,"NÃO ATENDEU À LEGISLAÇÃO",null,null,{"$f":"L1704","v":"--"}]
["Caracterização da Via: ",null,null,null,null,{"$f":"IF(ISBLANK(C1706),\"\",(IF((C1706=E1706),\"X\",\"\")))","v":""},null,null,{"$f":"IF(NOT(C1706=E1706),\"X\",\"\")","v":""},null,null,{"$f":"L1705","v":"--"}]
["Largura da Caixa da Via:",null,null,null,null,{"$f":"IF(ISBLANK(C1707),\"\",(IF((C1707<=E1707),\"X\",\"\")))","v":""},null,null,{"$f":"IF(ISBLANK(C1707),\"\",(IF((C1707>E1707),\"X\",\"\")))","v":""},null,null,"--"]
["Largura da Pista ",null,null,null,null,{"$f":"IF(ISBLANK(C1708),\"\",(IF((C1708<=E1708),\"X\",\"\")))","v":""},null,null,"",null,null,"--"]
["Largura da calçada",null,null,null,null,"",null,null,"",null,null,"--"]
["Largura do passeio",null,null,null,null,"",null,null,"",null,null,"--"]
["Ciclovia",null,null,null,null,"",null,null,"",null,null,"--"]
["Ciclofaixa",null,null,null,null,"",null,null,"",null,null,"--"]
[null,null,null,null,null,null,null,null,null,null,null,"--"]
["R44",{"$f":"IF(ISTEXT(VLOOKUP(A1714,'FICHA DE PROJETO'!$A$216:$I$398,2,FALSE)),VLOOKUP(A1714,'FICHA DE PROJETO'!$A$216:$I$398,2,FALSE),\"\")","v":""},null,null,null,null,null,null,null,null,null,{"$f":"IF((B1714=\"\"),\"--\",\"X\")","v":"--"}]
[null,null,"LEI",null,"PROJETO","ATENDEU À LEGISLAÇÃO",null,null,"NÃO ATENDEU À LEGISLAÇÃO",null,null,{"$f":"L1714","v":"--"}]
["Caracterização da Via: ",null,null,null,null,{"$f":"IF(ISBLANK(C1716),\"\",(IF((C1716=E1716),\"X\",\"\")))","v":""},null,null,{"$f":"IF(NOT(C1716=E1716),\"X\",\"\")","v":""},null,null,{"$f":"L1715","v":"--"}]
["Largura da Caixa da Via:",null,null,null,null,{"$f":"IF(ISBLANK(C1717),\"\",(IF((C1717<=E1717),\"X\",\"\")))","v":""},null,null,{"$f":"IF(ISBLANK(C1717),\"\",(IF((C1717>E1717),\"X\",\"\")))","v":""},null,null,"--"]
["Largura da Pista ",null,null,null,null,{"$f":"IF(ISBLANK(C1718),\"\",(IF((C1718<=E1718),\"X\",\"\")))","v":""},null,null,"",null,null,"--"]
["Largura da calçada",null,null,null,null,"",null,null,"",null,null,"--"]
["Largura do passeio",null,null,null,null,"",null,null,"",null,null,"--"]
["Ciclovia",null,null,null,null,"",null,null,"",null,null,"--"]
["Ciclofaixa",null,null,null,null,"",null,null,"",null,null,"--"]
[null,null,null,null,null,null,null,null,null,null,null,"--"]
["R45",{"$f":"IF(ISTEXT(VLOOKUP(A1724,'FICHA DE PROJETO'!$A$216:$I$398,2,FALSE)),VLOOKUP(A1724,'FICHA DE PROJETO'!$A$216:$I$398,2,FALSE),\"\")","v":""},null,null,null,null,null,null,null,null,null,{"$f":"IF((B1724=\"\"),\"--\",\"X\")","v":"--"}]
[null,null,"LEI",null,"PROJETO","ATENDEU À LEGISLAÇÃO",null,null,"NÃO ATENDEU À LEGISLAÇÃO",null,null,{"$f":"L1724","v":"--"}]
["Caracterização da Via: ",null,null,null,null,{"$f":"IF(ISBLANK(C1726),\"\",(IF((C1726=E1726),\"X\",\"\")))","v":""},null,null,{"$f":"IF(NOT(C1726=E1726),\"X\",\"\")","v":""},null,null,{"$f":"L1725","v":"--"}]
["Largura da Caixa da Via:",null,null,null,null,{"$f":"IF(ISBLANK(C1727),\"\",(IF((C1727<=E1727),\"X\",\"\")))","v":""},null,null,{"$f":"IF(ISBLANK(C1727),\"\",(IF((C1727>E1727),\"X\",\"\")))","v":""},null,null,"--"]
["Largura da Pista ",null,null,null,null,{"$f":"IF(ISBLANK(C1728),\"\",(IF((C1728<=E1728),\"X\",\"\")))","v":""},null,null,"",null,null,"--"]
["Largura da calçada",null,null,null,null,"",null,null,"",null,null,"--"]
["Largura do passeio",null,null,null,null,"",null,null,"",null,null,"--"]
["Ciclovia",null,null,null,null,"",null,null,"",null,null,"--"]
["Ciclofaixa",null,null,null,null,"",null,null,"",null,null,"--"]
[null,null,null,null,null,null,null,null,null,null,null,"--"]
["R46",{"$f":"IF(ISTEXT(VLOOKUP(A1734,'FICHA DE PROJETO'!$A$216:$I$398,2,FALSE)),VLOOKUP(A1734,'FICHA DE PROJETO'!$A$216:$I$398,2,FALSE),\"\")","v":""},null,null,null,null,null,null,null,null,null,{"$f":"IF((B1734=\"\"),\"--\",\"X\")","v":"--"}]
[null,null,"LEI",null,"PROJETO","ATENDEU À LEGISLAÇÃO",null,null,"NÃO ATENDEU À LEGISLAÇÃO",null,null,{"$f":"L1734","v":"--"}]
["Caracterização da Via: ",null,null,null,null,{"$f":"IF(ISBLANK(C1736),\"\",(IF((C1736=E1736),\"X\",\"\")))","v":""},null,null,{"$f":"IF(NOT(C1736=E1736),\"X\",\"\")","v":""},null,null,{"$f":"L1735","v":"--"}]
["Largura da Caixa da Via:",null,null,null,null,{"$f":"IF(ISBLANK(C1737),\"\",(IF((C1737<=E1737),\"X\",\"\")))","v":""},null,null,{"$f":"IF(ISBLANK(C1737),\"\",(IF((C1737>E1737),\"X\",\"\")))","v":""},null,null,"--"]
["Largura da Pista ",null,null,null,null,{"$f":"IF(ISBLANK(C1738),\"\",(IF((C1738<=E1738),\"X\",\"\")))","v":""},null,null,"",null,null,"--"]
["Largura da calçada",null,null,null,null,"",null,null,"",null,null,"--"]
["Largura do passeio",null,null,null,null,"",null,null,"",null,null,"--"]
["Ciclovia",null,null,null,null,"",null,null,"",null,null,"--"]
["Ciclofaixa",null,null,null,null,"",null,null,"",null,null,"--"]
[null,null,null,null,null,null,null,null,null,null,null,"--"]
["R47",{"$f":"IF(ISTEXT(VLOOKUP(A1744,'FICHA DE PROJETO'!$A$216:$I$398,2,FALSE)),VLOOKUP(A1744,'FICHA DE PROJETO'!$A$216:$I$398,2,FALSE),\"\")","v":""},null,null,null,null,null,null,null,null,null,{"$f":"IF((B1744=\"\"),\"--\",\"X\")","v":"--"}]
[null,null,"LEI",null,"PROJETO","ATENDEU À LEGISLAÇÃO",null,null,"NÃO ATENDEU À LEGISLAÇÃO",null,null,{"$f":"L1744","v":"--"}]
["Caracterização da Via: ",null,null,null,null,{"$f":"IF(ISBLANK(C1746),\"\",(IF((C1746=E1746),\"X\",\"\")))","v":""},null,null,{"$f":"IF(NOT(C1746=E1746),\"X\",\"\")","v":""},null,null,{"$f":"L1745","v":"--"}]
["Largura da Caixa da Via:",null,null,null,null,{"$f":"IF(ISBLANK(C1747),\"\",(IF((C1747<=E1747),\"X\",\"\")))","v":""},null,null,{"$f":"IF(ISBLANK(C1747),\"\",(IF((C1747>E1747),\"X\",\"\")))","v":""},null,null,"--"]
["Largura da Pista ",null,null,null,null,{"$f":"IF(ISBLANK(C1748),\"\",(IF((C1748<=E1748),\"X\",\"\")))","v":""},null,null,"",null,null,"--"]
["Largura da calçada",null,null,null,null,"",null,null,"",null,null,"--"]
["Largura do passeio",null,null,null,null,"",null,null,"",null,null,"--"]
["Ciclovia",null,null,null,null,"",null,null,"",null,null,"--"]
["Ciclofaixa",null,null,null,null,"",null,null,"",null,null,"--"]
[null,null,null,null,null,null,null,null,null,null,null,"--"]
["R48",{"$f":"IF(ISTEXT(VLOOKUP(A1754,'FICHA DE PROJETO'!$A$216:$I$398,2,FALSE)),VLOOKUP(A1754,'FICHA DE PROJETO'!$A$216:$I$398,2,FALSE),\"\")","v":""},null,null,null,null,null,null,null,null,null,{"$f":"IF((B1754=\"\"),\"--\",\"X\")","v":"--"}]
[null,null,"LEI",null,"PROJETO","ATENDEU À LEGISLAÇÃO",null,null,"NÃO ATENDEU À LEGISLAÇÃO",null,null,{"$f":"L1754","v":"--"}]
["Caracterização da Via: ",null,null,null,null,{"$f":"IF(ISBLANK(C1756),\"\",(IF((C1756=E1756),\"X\",\"\")))","v":""},null,null,{"$f":"IF(NOT(C1756=E1756),\"X\",\"\")","v":""},null,null,{"$f":"L1755","v":"--"}]
["Largura da Caixa da Via:",null,null,null,null,{"$f":"IF(ISBLANK(C1757),\"\",(IF((C1757<=E1757),\"X\",\"\")))","v":""},null,null,{"$f":"IF(ISBLANK(C1757),\"\",(IF((C1757>E1757),\"X\",\"\")))","v":""},null,null,"--"]
["Largura da Pista ",null,null,null,null,{"$f":"IF(ISBLANK(C1758),\"\",(IF((C1758<=E1758),\"X\",\"\")))","v":""},null,null,"",null,null,"--"]
["Largura da calçada",null,null,null,null,"",null,null,"",null,null,"--"]
["Largura do passeio",null,null,null,null,"",null,null,"",null,null,"--"]
["Ciclovia",null,null,null,null,"",null,null,"",null,null,"--"]
["Ciclofaixa",null,null,null,null,"",null,null,"",null,null,"--"]
[null,null,null,null,null,null,null,null,null,null,null,"--"]
["R49",{"$f":"IF(ISTEXT(VLOOKUP(A1764,'FICHA DE PROJETO'!$A$216:$I$398,2,FALSE)),VLOOKUP(A1764,'FICHA DE PROJETO'!$A$216:$I$398,2,FALSE),\"\")","v":""},null,null,null,null,null,null,null,null,null,{"$f":"IF((B1764=\"\"),\"--\",\"X\")","v":"--"}]
[null,null,"LEI",null,"PROJETO","ATENDEU À LEGISLAÇÃO",null,null,"NÃO ATENDEU À LEGISLAÇÃO",null,null,{"$f":"L1764","v":"--"}]
["Caracterização da Via: ",null,null,null,null,{"$f":"IF(ISBLANK(C1766),\"\",(IF((C1766=E1766),\"X\",\"\")))","v":""},null,null,{"$f":"IF(NOT(C1766=E1766),\"X\",\"\")","v":""},null,null,{"$f":"L1765","v":"--"}]
["Largura da Caixa da Via:",null,null,null,null,{"$f":"IF(ISBLANK(C1767),\"\",(IF((C1767<=E1767),\"X\",\"\")))","v":""},null,null,{"$f":"IF(ISBLANK(C1767),\"\",(IF((C1767>E1767),\"X\",\"\")))","v":""},null,null,"--"]
["Largura da Pista ",null,null,null,null,{"$f":"IF(ISBLANK(C1768),\"\",(IF((C1768<=E1768),\"X\",\"\")))","v":""},null,null,"",null,null,"--"]
["Largura da calçada",null,null,null,null,"",null,null,"",null,null,"--"]
["Largura do passeio",null,null,null,null,"",null,null,"",null,null,"--"]
["Ciclovia",null,null,null,null,"",null,null,"",null,null,"--"]
["Ciclofaixa",null,null,null,null,"",null,null,"",null,null,"--"]
[null,null,null,null,null,null,null,null,null,null,null,"--"]
["R50",{"$f":"IF(ISTEXT(VLOOKUP(A1774,'FICHA DE PROJETO'!$A$216:$I$398,2,FALSE)),VLOOKUP(A1774,'FICHA DE PROJETO'!$A$216:$I$398,2,FALSE),\"\")","v":""},null,null,null,null,null,null,null,null,null,{"$f":"IF((B1774=\"\"),\"--\",\"X\")","v":"--"}]
[null,null,"LEI",null,"PROJETO","ATENDEU À LEGISLAÇÃO",null,null,"NÃO ATENDEU À LEGISLAÇÃO",null,null,{"$f":"L1774","v":"--"}]
["Caracterização da Via: ",null,null,null,null,{"$f":"IF(ISBLANK(C1776),\"\",(IF((C1776=E1776),\"X\",\"\")))","v":""},null,null,{"$f":"IF(NOT(C1776=E1776),\"X\",\"\")","v":""},null,null,{"$f":"L1775","v":"--"}]
["Largura da Caixa da Via:",null,null,null,null,{"$f":"IF(ISBLANK(C1777),\"\",(IF((C1777<=E1777),\"X\",\"\")))","v":""},null,null,{"$f":"IF(ISBLANK(C1777),\"\",(IF((C1777>E1777),\"X\",\"\")))","v":""},null,null,"--"]
["Largura da Pista ",null,null,null,null,{"$f":"IF(ISBLANK(C1778),\"\",(IF((C1778<=E1778),\"X\",\"\")))","v":""},null,null,"",null,null,"--"]
["Largura da calçada",null,null,null,null,"",null,null,"",null,null,"--"]
["Largura do passeio",null,null,null,null,"",null,null,"",null,null,"--"]
["Ciclovia",null,null,null,null,"",null,null,"",null,null,"--"]
["Ciclofaixa",null,null,null,null,"",null,null,"",null,null,"--"]
[null,null,null,null,null,null,null,null,null,null,null,"--"]
["RUAS DO LOTE 03",null,null,null,null,null,null,null,null,null,null,{"$f":"IF('FICHA DE PROJETO'!K398=\"X\",\"X\",\"--\")","v":"--"}]
["R01",{"$f":"IF(ISTEXT(VLOOKUP(A1785,'FICHA DE PROJETO'!$A$399:$I$579,2,FALSE)),VLOOKUP(A1785,'FICHA DE PROJETO'!$A$399:$I$579,2,FALSE),\"\")","v":""},null,null,null,null,null,null,null,null,null,{"$f":"IF((B1785=\"\"),\"--\",\"X\")","v":"--"}]
[null,null,"LEI",null,"PROJETO","ATENDEU À LEGISLAÇÃO",null,null,"NÃO ATENDEU À LEGISLAÇÃO",null,null,{"$f":"L1785","v":"--"}]
["Caracterização da Via: ",null,"Local",null,"Local",{"$f":"IF(ISBLANK(C1787),\"\",(IF((C1787=E1787),\"X\",\"\")))","v":"X"},null,null,{"$f":"IF(NOT(C1787=E1787),\"X\",\"\")","v":""},null,null,{"$f":"L1786","v":"--"}]
["Largura da Caixa da Via:",null,18,null,18,{"$f":"IF(ISBLANK(C1788),\"\",(IF((C1788<=E1788),\"X\",\"\")))","v":"X"},null,null,{"$f":"IF(ISBLANK(C1788),\"\",(IF((C1788>E1788),\"X\",\"\")))","v":""},null,null,"--"]
["Largura da Pista ",null,10,null,9,{"$f":"IF(ISBLANK(C1789),\"\",(IF((C1789<=E1789),\"X\",\"\")))","v":""},null,null,"X",null,null,"--"]
["Largura da calçada",null,4,null,4.5,"X",null,null,"",null,null,"--"]
["Largura do passeio",null,1.5,null,1.2,"",null,null,"X",null,null,"--"]
["Ciclovia",null,null,null,null,"",null,null,"",null,null,"--"]
["Ciclofaixa",null,null,null,null,"",null,null,"",null,null,"--"]
[null,null,null,null,null,null,null,null,null,null,null,"--"]
["R02",{"$f":"IF(ISTEXT(VLOOKUP(A1795,'FICHA DE PROJETO'!$A$399:$I$579,2,FALSE)),VLOOKUP(A1795,'FICHA DE PROJETO'!$A$399:$I$579,2,FALSE),\"\")","v":""},null,null,null,null,null,null,null,null,null,{"$f":"IF((B1795=\"\"),\"--\",\"X\")","v":"--"}]
[null,null,"LEI",null,"PROJETO","ATENDEU À LEGISLAÇÃO",null,null,"NÃO ATENDEU À LEGISLAÇÃO",null,null,{"$f":"L1795","v":"--"}]
["Caracterização da Via: ",null,"Local",null,"Local",{"$f":"IF(ISBLANK(C1797),\"\",(IF((C1797=E1797),\"X\",\"\")))","v":"X"},null,null,{"$f":"IF(NOT(C1797=E1797),\"X\",\"\")","v":""},null,null,{"$f":"L1796","v":"--"}]
["Largura da Caixa da Via:",null,14,null,14,{"$f":"IF(ISBLANK(C1798),\"\",(IF((C1798<=E1798),\"X\",\"\")))","v":"X"},null,null,{"$f":"IF(ISBLANK(C1798),\"\",(IF((C1798>E1798),\"X\",\"\")))","v":""},null,null,"--"]
["Largura da Pista ",null,7,null,6,{"$f":"IF(ISBLANK(C1799),\"\",(IF((C1799<=E1799),\"X\",\"\")))","v":""},null,null,"X",null,null,"--"]
["Largura da calçada",null,3,null,2.5,"",null,null,"X",null,null,"--"]
["Largura do passeio",null,1.5,null,1.2,"",null,null,"X",null,null,"--"]
["Ciclovia",null,null,null,null,"",null,null,"",null,null,"--"]
["Ciclofaixa",null,null,null,null,"",null,null,"",null,null,"--"]
[null,null,null,null,null,null,null,null,null,null,null,"--"]
["R03",{"$f":"IF(ISTEXT(VLOOKUP(A1805,'FICHA DE PROJETO'!$A$399:$I$579,2,FALSE)),VLOOKUP(A1805,'FICHA DE PROJETO'!$A$399:$I$579,2,FALSE),\"\")","v":""},null,null,null,null,null,null,null,null,null,{"$f":"IF((B1805=\"\"),\"--\",\"X\")","v":"--"}]
[null,null,"LEI",null,"PROJETO","ATENDEU À LEGISLAÇÃO",null,null,"NÃO ATENDEU À LEGISLAÇÃO",null,null,{"$f":"L1805","v":"--"}]
["Caracterização da Via: ",null,"Local",null,"Local",{"$f":"IF(ISBLANK(C1807),\"\",(IF((C1807=E1807),\"X\",\"\")))","v":"X"},null,null,{"$f":"IF(NOT(C1807=E1807),\"X\",\"\")","v":""},null,null,{"$f":"L1806","v":"--"}]
["Largura da Caixa da Via:",null,15,null,15,{"$f":"IF(ISBLANK(C1808),\"\",(IF((C1808<=E1808),\"X\",\"\")))","v":"X"},null,null,{"$f":"IF(ISBLANK(C1808),\"\",(IF((C1808>E1808),\"X\",\"\")))","v":""},null,null,"--"]
["Largura da Pista ",null,7,null,6,{"$f":"IF(ISBLANK(C1809),\"\",(IF((C1809<=E1809),\"X\",\"\")))","v":""},null,null,"X",null,null,"--"]
["Largura da calçada",null,3,null,2.5,"",null,null,"X",null,null,"--"]
["Largura do passeio",null,1.5,null,1.2,"",null,null,"X",null,null,"--"]
["Ciclovia",null,null,null,null,"",null,null,"",null,null,"--"]
["Ciclofaixa",null,null,null,null,"",null,null,"",null,null,"--"]
[null,null,null,null,null,null,null,null,null,null,null,"--"]
["R04",{"$f":"IF(ISTEXT(VLOOKUP(A1815,'FICHA DE PROJETO'!$A$399:$I$579,2,FALSE)),VLOOKUP(A1815,'FICHA DE PROJETO'!$A$399:$I$579,2,FALSE),\"\")","v":""},null,null,null,null,null,null,null,null,null,{"$f":"IF((B1815=\"\"),\"--\",\"X\")","v":"--"}]
[null,null,"LEI",null,"PROJETO","ATENDEU À LEGISLAÇÃO",null,null,"NÃO ATENDEU À LEGISLAÇÃO",null,null,{"$f":"L1815","v":"--"}]
["Caracterização da Via: ",null,"Local",null,"Local",{"$f":"IF(ISBLANK(C1817),\"\",(IF((C1817=E1817),\"X\",\"\")))","v":"X"},null,null,{"$f":"IF(NOT(C1817=E1817),\"X\",\"\")","v":""},null,null,{"$f":"L1816","v":"--"}]
["Largura da Caixa da Via:",null,14,null,12,{"$f":"IF(ISBLANK(C1818),\"\",(IF((C1818<=E1818),\"X\",\"\")))","v":""},null,null,{"$f":"IF(ISBLANK(C1818),\"\",(IF((C1818>E1818),\"X\",\"\")))","v":"X"},null,null,"--"]
["Largura da Pista ",null,8,null,7,{"$f":"IF(ISBLANK(C1819),\"\",(IF((C1819<=E1819),\"X\",\"\")))","v":""},null,null,"X",null,null,"--"]
["Largura da calçada",null,3,null,3.5,"X",null,null,"",null,null,"--"]
["Largura do passeio",null,1.5,null,1.2,"",null,null,"X",null,null,"--"]
["Ciclovia",null,null,null,null,"",null,null,"",null,null,"--"]
["Ciclofaixa",null,null,null,null,"",null,null,"",null,null,"--"]
[null,null,null,null,null,null,null,null,null,null,null,"--"]
["R05",{"$f":"IF(ISTEXT(VLOOKUP(A1825,'FICHA DE PROJETO'!$A$399:$I$579,2,FALSE)),VLOOKUP(A1825,'FICHA DE PROJETO'!$A$399:$I$579,2,FALSE),\"\")","v":""},null,null,null,null,null,null,null,null,null,{"$f":"IF((B1825=\"\"),\"--\",\"X\")","v":"--"}]
[null,null,"LEI",null,"PROJETO","ATENDEU À LEGISLAÇÃO",null,null,"NÃO ATENDEU À LEGISLAÇÃO",null,null,{"$f":"L1825","v":"--"}]
["Caracterização da Via: ",null,null,null,null,{"$f":"IF(ISBLANK(C1827),\"\",(IF((C1827=E1827),\"X\",\"\")))","v":""},null,null,{"$f":"IF(NOT(C1827=E1827),\"X\",\"\")","v":""},null,null,{"$f":"L1826","v":"--"}]
["Largura da Caixa da Via:",null,null,null,null,{"$f":"IF(ISBLANK(C1828),\"\",(IF((C1828<=E1828),\"X\",\"\")))","v":""},null,null,{"$f":"IF(ISBLANK(C1828),\"\",(IF((C1828>E1828),\"X\",\"\")))","v":""},null,null,"--"]
["Largura da Pista ",null,null,null,null,{"$f":"IF(ISBLANK(C1829),\"\",(IF((C1829<=E1829),\"X\",\"\")))","v":""},null,null,"",null,null,"--"]
["Largura da calçada",null,null,null,null,"",null,null,"",null,null,"--"]
["Largura do passeio",null,null,null,null,"",null,null,"",null,null,"--"]
["Ciclovia",null,null,null,null,"",null,null,"",null,null,"--"]
["Ciclofaixa",null,null,null,null,"",null,null,"",null,null,"--"]
[null,null,null,null,null,null,null,null,null,null,null,"--"]
["R06",{"$f":"IF(ISTEXT(VLOOKUP(A1835,'FICHA DE PROJETO'!$A$399:$I$579,2,FALSE)),VLOOKUP(A1835,'FICHA DE PROJETO'!$A$399:$I$579,2,FALSE),\"\")","v":""},null,null,null,null,null,null,null,null,null,{"$f":"IF((B1835=\"\"),\"--\",\"X\")","v":"--"}]
[null,null,"LEI",null,"PROJETO","ATENDEU À LEGISLAÇÃO",null,null,"NÃO ATENDEU À LEGISLAÇÃO",null,null,{"$f":"L1835","v":"--"}]
["Caracterização da Via: ",null,null,null,null,{"$f":"IF(ISBLANK(C1837),\"\",(IF((C1837=E1837),\"X\",\"\")))","v":""},null,null,{"$f":"IF(NOT(C1837=E1837),\"X\",\"\")","v":""},null,null,{"$f":"L1836","v":"--"}]
["Largura da Caixa da Via:",null,null,null,null,{"$f":"IF(ISBLANK(C1838),\"\",(IF((C1838<=E1838),\"X\",\"\")))","v":""},null,null,{"$f":"IF(ISBLANK(C1838),\"\",(IF((C1838>E1838),\"X\",\"\")))","v":""},null,null,"--"]
["Largura da Pista ",null,null,null,null,{"$f":"IF(ISBLANK(C1839),\"\",(IF((C1839<=E1839),\"X\",\"\")))","v":""},null,null,"",null,null,"--"]
["Largura da calçada",null,null,null,null,"",null,null,"",null,null,"--"]
["Largura do passeio",null,null,null,null,"",null,null,"",null,null,"--"]
["Ciclovia",null,null,null,null,"",null,null,"",null,null,"--"]
["Ciclofaixa",null,null,null,null,"",null,null,"",null,null,"--"]
[null,null,null,null,null,null,null,null,null,null,null,"--"]
["R07",{"$f":"IF(ISTEXT(VLOOKUP(A1845,'FICHA DE PROJETO'!$A$399:$I$579,2,FALSE)),VLOOKUP(A1845,'FICHA DE PROJETO'!$A$399:$I$579,2,FALSE),\"\")","v":""},null,null,null,null,null,null,null,null,null,{"$f":"IF((B1845=\"\"),\"--\",\"X\")","v":"--"}]
[null,null,"LEI",null,"PROJETO","ATENDEU À LEGISLAÇÃO",null,null,"NÃO ATENDEU À LEGISLAÇÃO",null,null,{"$f":"L1845","v":"--"}]
["Caracterização da Via: ",null,null,null,null,{"$f":"IF(ISBLANK(C1847),\"\",(IF((C1847=E1847),\"X\",\"\")))","v":""},null,null,{"$f":"IF(NOT(C1847=E1847),\"X\",\"\")","v":""},null,null,{"$f":"L1846","v":"--"}]
["Largura da Caixa da Via:",null,null,null,null,{"$f":"IF(ISBLANK(C1848),\"\",(IF((C1848<=E1848),\"X\",\"\")))","v":""},null,null,{"$f":"IF(ISBLANK(C1848),\"\",(IF((C1848>E1848),\"X\",\"\")))","v":""},null,null,"--"]
["Largura da Pista ",null,null,null,null,{"$f":"IF(ISBLANK(C1849),\"\",(IF((C1849<=E1849),\"X\",\"\")))","v":""},null,null,"",null,null,"--"]
["Largura da calçada",null,null,null,null,"",null,null,"",null,null,"--"]
["Largura do passeio",null,null,null,null,"",null,null,"",null,null,"--"]
["Ciclovia",null,null,null,null,"",null,null,"",null,null,"--"]
["Ciclofaixa",null,null,null,null,"",null,null,"",null,null,"--"]
[null,null,null,null,null,null,null,null,null,null,null,"--"]
["R08",{"$f":"IF(ISTEXT(VLOOKUP(A1855,'FICHA DE PROJETO'!$A$399:$I$579,2,FALSE)),VLOOKUP(A1855,'FICHA DE PROJETO'!$A$399:$I$579,2,FALSE),\"\")","v":""},null,null,null,null,null,null,null,null,null,{"$f":"IF((B1855=\"\"),\"--\",\"X\")","v":"--"}]
[null,null,"LEI",null,"PROJETO","ATENDEU À LEGISLAÇÃO",null,null,"NÃO ATENDEU À LEGISLAÇÃO",null,null,{"$f":"L1855","v":"--"}]
["Caracterização da Via: ",null,null,null,null,{"$f":"IF(ISBLANK(C1857),\"\",(IF((C1857=E1857),\"X\",\"\")))","v":""},null,null,{"$f":"IF(NOT(C1857=E1857),\"X\",\"\")","v":""},null,null,{"$f":"L1856","v":"--"}]
["Largura da Caixa da Via:",null,null,null,null,{"$f":"IF(ISBLANK(C1858),\"\",(IF((C1858<=E1858),\"X\",\"\")))","v":""},null,null,{"$f":"IF(ISBLANK(C1858),\"\",(IF((C1858>E1858),\"X\",\"\")))","v":""},null,null,"--"]
["Largura da Pista ",null,null,null,null,{"$f":"IF(ISBLANK(C1859),\"\",(IF((C1859<=E1859),\"X\",\"\")))","v":""},null,null,"",null,null,"--"]
["Largura da calçada",null,null,null,null,"",null,null,"",null,null,"--"]
["Largura do passeio",null,null,null,null,"",null,null,"",null,null,"--"]
["Ciclovia",null,null,null,null,"",null,null,"",null,null,"--"]
["Ciclofaixa",null,null,null,null,"",null,null,"",null,null,"--"]
[null,null,null,null,null,null,null,null,null,null,null,"--"]
["R09",{"$f":"IF(ISTEXT(VLOOKUP(A1865,'FICHA DE PROJETO'!$A$399:$I$579,2,FALSE)),VLOOKUP(A1865,'FICHA DE PROJETO'!$A$399:$I$579,2,FALSE),\"\")","v":""},null,null,null,null,null,null,null,null,null,{"$f":"IF((B1865=\"\"),\"--\",\"X\")","v":"--"}]
[null,null,"LEI",null,"PROJETO","ATENDEU À LEGISLAÇÃO",null,null,"NÃO ATENDEU À LEGISLAÇÃO",null,null,{"$f":"L1865","v":"--"}]
["Caracterização da Via: ",null,null,null,null,{"$f":"IF(ISBLANK(C1867),\"\",(IF((C1867=E1867),\"X\",\"\")))","v":""},null,null,{"$f":"IF(NOT(C1867=E1867),\"X\",\"\")","v":""},null,null,{"$f":"L1866","v":"--"}]
["Largura da Caixa da Via:",null,null,null,null,{"$f":"IF(ISBLANK(C1868),\"\",(IF((C1868<=E1868),\"X\",\"\")))","v":""},null,null,{"$f":"IF(ISBLANK(C1868),\"\",(IF((C1868>E1868),\"X\",\"\")))","v":""},null,null,"--"]
["Largura da Pista ",null,null,null,null,{"$f":"IF(ISBLANK(C1869),\"\",(IF((C1869<=E1869),\"X\",\"\")))","v":""},null,null,"",null,null,"--"]
["Largura da calçada",null,null,null,null,"",null,null,"",null,null,"--"]
["Largura do passeio",null,null,null,null,"",null,null,"",null,null,"--"]
["Ciclovia",null,null,null,null,"",null,null,"",null,null,"--"]
["Ciclofaixa",null,null,null,null,"",null,null,"",null,null,"--"]
[null,null,null,null,null,null,null,null,null,null,null,"--"]
["R10",{"$f":"IF(ISTEXT(VLOOKUP(A1875,'FICHA DE PROJETO'!$A$399:$I$579,2,FALSE)),VLOOKUP(A1875,'FICHA DE PROJETO'!$A$399:$I$579,2,FALSE),\"\")","v":""},null,null,null,null,null,null,null,null,null,{"$f":"IF((B1875=\"\"),\"--\",\"X\")","v":"--"}]
[null,null,"LEI",null,"PROJETO","ATENDEU À LEGISLAÇÃO",null,null,"NÃO ATENDEU À LEGISLAÇÃO",null,null,{"$f":"L1875","v":"--"}]
["Caracterização da Via: ",null,null,null,null,{"$f":"IF(ISBLANK(C1877),\"\",(IF((C1877=E1877),\"X\",\"\")))","v":""},null,null,{"$f":"IF(NOT(C1877=E1877),\"X\",\"\")","v":""},null,null,{"$f":"L1876","v":"--"}]
["Largura da Caixa da Via:",null,null,null,null,{"$f":"IF(ISBLANK(C1878),\"\",(IF((C1878<=E1878),\"X\",\"\")))","v":""},null,null,{"$f":"IF(ISBLANK(C1878),\"\",(IF((C1878>E1878),\"X\",\"\")))","v":""},null,null,"--"]
["Largura da Pista ",null,null,null,null,{"$f":"IF(ISBLANK(C1879),\"\",(IF((C1879<=E1879),\"X\",\"\")))","v":""},null,null,"",null,null,"--"]
["Largura da calçada",null,null,null,null,"",null,null,"",null,null,"--"]
["Largura do passeio",null,null,null,null,"",null,null,"",null,null,"--"]
["Ciclovia",null,null,null,null,"",null,null,"",null,null,"--"]
["Ciclofaixa",null,null,null,null,"",null,null,"",null,null,"--"]
[null,null,null,null,null,null,null,null,null,null,null,"--"]
["R11",{"$f":"IF(ISTEXT(VLOOKUP(A1885,'FICHA DE PROJETO'!$A$399:$I$579,2,FALSE)),VLOOKUP(A1885,'FICHA DE PROJETO'!$A$399:$I$579,2,FALSE),\"\")","v":""},null,null,null,null,null,null,null,null,null,{"$f":"IF((B1885=\"\"),\"--\",\"X\")","v":"--"}]
[null,null,"LEI",null,"PROJETO","ATENDEU À LEGISLAÇÃO",null,null,"NÃO ATENDEU À LEGISLAÇÃO",null,null,{"$f":"L1885","v":"--"}]
["Caracterização da Via: ",null,null,null,null,{"$f":"IF(ISBLANK(C1887),\"\",(IF((C1887=E1887),\"X\",\"\")))","v":""},null,null,{"$f":"IF(NOT(C1887=E1887),\"X\",\"\")","v":""},null,null,{"$f":"L1886","v":"--"}]
["Largura da Caixa da Via:",null,null,null,null,{"$f":"IF(ISBLANK(C1888),\"\",(IF((C1888<=E1888),\"X\",\"\")))","v":""},null,null,{"$f":"IF(ISBLANK(C1888),\"\",(IF((C1888>E1888),\"X\",\"\")))","v":""},null,null,"--"]
["Largura da Pista ",null,null,null,null,{"$f":"IF(ISBLANK(C1889),\"\",(IF((C1889<=E1889),\"X\",\"\")))","v":""},null,null,"",null,null,"--"]
["Largura da calçada",null,null,null,null,"",null,null,"",null,null,"--"]
["Largura do passeio",null,null,null,null,"",null,null,"",null,null,"--"]
["Ciclovia",null,null,null,null,"",null,null,"",null,null,"--"]
["Ciclofaixa",null,null,null,null,"",null,null,"",null,null,"--"]
[null,null,null,null,null,null,null,null,null,null,null,"--"]
["R12",{"$f":"IF(ISTEXT(VLOOKUP(A1895,'FICHA DE PROJETO'!$A$399:$I$579,2,FALSE)),VLOOKUP(A1895,'FICHA DE PROJETO'!$A$399:$I$579,2,FALSE),\"\")","v":""},null,null,null,null,null,null,null,null,null,{"$f":"IF((B1895=\"\"),\"--\",\"X\")","v":"--"}]
[null,null,"LEI",null,"PROJETO","ATENDEU À LEGISLAÇÃO",null,null,"NÃO ATENDEU À LEGISLAÇÃO",null,null,{"$f":"L1895","v":"--"}]
["Caracterização da Via: ",null,null,null,null,{"$f":"IF(ISBLANK(C1897),\"\",(IF((C1897=E1897),\"X\",\"\")))","v":""},null,null,{"$f":"IF(NOT(C1897=E1897),\"X\",\"\")","v":""},null,null,{"$f":"L1896","v":"--"}]
["Largura da Caixa da Via:",null,null,null,null,{"$f":"IF(ISBLANK(C1898),\"\",(IF((C1898<=E1898),\"X\",\"\")))","v":""},null,null,{"$f":"IF(ISBLANK(C1898),\"\",(IF((C1898>E1898),\"X\",\"\")))","v":""},null,null,"--"]
["Largura da Pista ",null,null,null,null,{"$f":"IF(ISBLANK(C1899),\"\",(IF((C1899<=E1899),\"X\",\"\")))","v":""},null,null,"",null,null,"--"]
["Largura da calçada",null,null,null,null,"",null,null,"",null,null,"--"]
["Largura do passeio",null,null,null,null,"",null,null,"",null,null,"--"]
["Ciclovia",null,null,null,null,"",null,null,"",null,null,"--"]
["Ciclofaixa",null,null,null,null,"",null,null,"",null,null,"--"]
[null,null,null,null,null,null,null,null,null,null,null,"--"]
["R13",{"$f":"IF(ISTEXT(VLOOKUP(A1905,'FICHA DE PROJETO'!$A$399:$I$579,2,FALSE)),VLOOKUP(A1905,'FICHA DE PROJETO'!$A$399:$I$579,2,FALSE),\"\")","v":""},null,null,null,null,null,null,null,null,null,{"$f":"IF((B1905=\"\"),\"--\",\"X\")","v":"--"}]
[null,null,"LEI",null,"PROJETO","ATENDEU À LEGISLAÇÃO",null,null,"NÃO ATENDEU À LEGISLAÇÃO",null,null,{"$f":"L1905","v":"--"}]
["Caracterização da Via: ",null,null,null,null,{"$f":"IF(ISBLANK(C1907),\"\",(IF((C1907=E1907),\"X\",\"\")))","v":""},null,null,{"$f":"IF(NOT(C1907=E1907),\"X\",\"\")","v":""},null,null,{"$f":"L1906","v":"--"}]
["Largura da Caixa da Via:",null,null,null,null,{"$f":"IF(ISBLANK(C1908),\"\",(IF((C1908<=E1908),\"X\",\"\")))","v":""},null,null,{"$f":"IF(ISBLANK(C1908),\"\",(IF((C1908>E1908),\"X\",\"\")))","v":""},null,null,"--"]
["Largura da Pista ",null,null,null,null,{"$f":"IF(ISBLANK(C1909),\"\",(IF((C1909<=E1909),\"X\",\"\")))","v":""},null,null,"",null,null,"--"]
["Largura da calçada",null,null,null,null,"",null,null,"",null,null,"--"]
["Largura do passeio",null,null,null,null,"",null,null,"",null,null,"--"]
["Ciclovia",null,null,null,null,"",null,null,"",null,null,"--"]
["Ciclofaixa",null,null,null,null,"",null,null,"",null,null,"--"]
[null,null,null,null,null,null,null,null,null,null,null,"--"]
["R14",{"$f":"IF(ISTEXT(VLOOKUP(A1915,'FICHA DE PROJETO'!$A$399:$I$579,2,FALSE)),VLOOKUP(A1915,'FICHA DE PROJETO'!$A$399:$I$579,2,FALSE),\"\")","v":""},null,null,null,null,null,null,null,null,null,{"$f":"IF((B1915=\"\"),\"--\",\"X\")","v":"--"}]
[null,null,"LEI",null,"PROJETO","ATENDEU À LEGISLAÇÃO",null,null,"NÃO ATENDEU À LEGISLAÇÃO",null,null,{"$f":"L1915","v":"--"}]
["Caracterização da Via: ",null,null,null,null,{"$f":"IF(ISBLANK(C1917),\"\",(IF((C1917=E1917),\"X\",\"\")))","v":""},null,null,{"$f":"IF(NOT(C1917=E1917),\"X\",\"\")","v":""},null,null,{"$f":"L1916","v":"--"}]
["Largura da Caixa da Via:",null,null,null,null,{"$f":"IF(ISBLANK(C1918),\"\",(IF((C1918<=E1918),\"X\",\"\")))","v":""},null,null,{"$f":"IF(ISBLANK(C1918),\"\",(IF((C1918>E1918),\"X\",\"\")))","v":""},null,null,"--"]
["Largura da Pista ",null,null,null,null,{"$f":"IF(ISBLANK(C1919),\"\",(IF((C1919<=E1919),\"X\",\"\")))","v":""},null,null,"",null,null,"--"]
["Largura da calçada",null,null,null,null,"",null,null,"",null,null,"--"]
["Largura do passeio",null,null,null,null,"",null,null,"",null,null,"--"]
["Ciclovia",null,null,null,null,"",null,null,"",null,null,"--"]
["Ciclofaixa",null,null,null,null,"",null,null,"",null,null,"--"]
[null,null,null,null,null,null,null,null,null,null,null,"--"]
["R15",{"$f":"IF(ISTEXT(VLOOKUP(A1925,'FICHA DE PROJETO'!$A$399:$I$579,2,FALSE)),VLOOKUP(A1925,'FICHA DE PROJETO'!$A$399:$I$579,2,FALSE),\"\")","v":""},null,null,null,null,null,null,null,null,null,{"$f":"IF((B1925=\"\"),\"--\",\"X\")","v":"--"}]
[null,null,"LEI",null,"PROJETO","ATENDEU À LEGISLAÇÃO",null,null,"NÃO ATENDEU À LEGISLAÇÃO",null,null,{"$f":"L1925","v":"--"}]
["Caracterização da Via: ",null,null,null,null,{"$f":"IF(ISBLANK(C1927),\"\",(IF((C1927=E1927),\"X\",\"\")))","v":""},null,null,{"$f":"IF(NOT(C1927=E1927),\"X\",\"\")","v":""},null,null,{"$f":"L1926","v":"--"}]
["Largura da Caixa da Via:",null,null,null,null,{"$f":"IF(ISBLANK(C1928),\"\",(IF((C1928<=E1928),\"X\",\"\")))","v":""},null,null,{"$f":"IF(ISBLANK(C1928),\"\",(IF((C1928>E1928),\"X\",\"\")))","v":""},null,null,"--"]
["Largura da Pista ",null,null,null,null,{"$f":"IF(ISBLANK(C1929),\"\",(IF((C1929<=E1929),\"X\",\"\")))","v":""},null,null,"",null,null,"--"]
["Largura da calçada",null,null,null,null,"",null,null,"",null,null,"--"]
["Largura do passeio",null,null,null,null,"",null,null,"",null,null,"--"]
["Ciclovia",null,null,null,null,"",null,null,"",null,null,"--"]
["Ciclofaixa",null,null,null,null,"",null,null,"",null,null,"--"]
[null,null,null,null,null,null,null,null,null,null,null,"--"]
["R16",{"$f":"IF(ISTEXT(VLOOKUP(A1935,'FICHA DE PROJETO'!$A$399:$I$579,2,FALSE)),VLOOKUP(A1935,'FICHA DE PROJETO'!$A$399:$I$579,2,FALSE),\"\")","v":""},null,null,null,null,null,null,null,null,null,{"$f":"IF((B1935=\"\"),\"--\",\"X\")","v":"--"}]
[null,null,"LEI",null,"PROJETO","ATENDEU À LEGISLAÇÃO",null,null,"NÃO ATENDEU À LEGISLAÇÃO",null,null,{"$f":"L1935","v":"--"}]
["Caracterização da Via: ",null,null,null,null,{"$f":"IF(ISBLANK(C1937),\"\",(IF((C1937=E1937),\"X\",\"\")))","v":""},null,null,{"$f":"IF(NOT(C1937=E1937),\"X\",\"\")","v":""},null,null,{"$f":"L1936","v":"--"}]
["Largura da Caixa da Via:",null,null,null,null,{"$f":"IF(ISBLANK(C1938),\"\",(IF((C1938<=E1938),\"X\",\"\")))","v":""},null,null,{"$f":"IF(ISBLANK(C1938),\"\",(IF((C1938>E1938),\"X\",\"\")))","v":""},null,null,"--"]
["Largura da Pista ",null,null,null,null,{"$f":"IF(ISBLANK(C1939),\"\",(IF((C1939<=E1939),\"X\",\"\")))","v":""},null,null,"",null,null,"--"]
["Largura da calçada",null,null,null,null,"",null,null,"",null,null,"--"]
["Largura do passeio",null,null,null,null,"",null,null,"",null,null,"--"]
["Ciclovia",null,null,null,null,"",null,null,"",null,null,"--"]
["Ciclofaixa",null,null,null,null,"",null,null,"",null,null,"--"]
[null,null,null,null,null,null,null,null,null,null,null,"--"]
["R17",{"$f":"IF(ISTEXT(VLOOKUP(A1945,'FICHA DE PROJETO'!$A$399:$I$579,2,FALSE)),VLOOKUP(A1945,'FICHA DE PROJETO'!$A$399:$I$579,2,FALSE),\"\")","v":""},null,null,null,null,null,null,null,null,null,{"$f":"IF((B1945=\"\"),\"--\",\"X\")","v":"--"}]
[null,null,"LEI",null,"PROJETO","ATENDEU À LEGISLAÇÃO",null,null,"NÃO ATENDEU À LEGISLAÇÃO",null,null,{"$f":"L1945","v":"--"}]
["Caracterização da Via: ",null,null,null,null,{"$f":"IF(ISBLANK(C1947),\"\",(IF((C1947=E1947),\"X\",\"\")))","v":""},null,null,{"$f":"IF(NOT(C1947=E1947),\"X\",\"\")","v":""},null,null,{"$f":"L1946","v":"--"}]
["Largura da Caixa da Via:",null,null,null,null,{"$f":"IF(ISBLANK(C1948),\"\",(IF((C1948<=E1948),\"X\",\"\")))","v":""},null,null,{"$f":"IF(ISBLANK(C1948),\"\",(IF((C1948>E1948),\"X\",\"\")))","v":""},null,null,"--"]
["Largura da Pista ",null,null,null,null,{"$f":"IF(ISBLANK(C1949),\"\",(IF((C1949<=E1949),\"X\",\"\")))","v":""},null,null,"",null,null,"--"]
["Largura da calçada",null,null,null,null,"",null,null,"",null,null,"--"]
["Largura do passeio",null,null,null,null,"",null,null,"",null,null,"--"]
["Ciclovia",null,null,null,null,"",null,null,"",null,null,"--"]
["Ciclofaixa",null,null,null,null,"",null,null,"",null,null,"--"]
[null,null,null,null,null,null,null,null,null,null,null,"--"]
["R18",{"$f":"IF(ISTEXT(VLOOKUP(A1955,'FICHA DE PROJETO'!$A$399:$I$579,2,FALSE)),VLOOKUP(A1955,'FICHA DE PROJETO'!$A$399:$I$579,2,FALSE),\"\")","v":""},null,null,null,null,null,null,null,null,null,{"$f":"IF((B1955=\"\"),\"--\",\"X\")","v":"--"}]
[null,null,"LEI",null,"PROJETO","ATENDEU À LEGISLAÇÃO",null,null,"NÃO ATENDEU À LEGISLAÇÃO",null,null,{"$f":"L1955","v":"--"}]
["Caracterização da Via: ",null,null,null,null,{"$f":"IF(ISBLANK(C1957),\"\",(IF((C1957=E1957),\"X\",\"\")))","v":""},null,null,{"$f":"IF(NOT(C1957=E1957),\"X\",\"\")","v":""},null,null,{"$f":"L1956","v":"--"}]
["Largura da Caixa da Via:",null,null,null,null,{"$f":"IF(ISBLANK(C1958),\"\",(IF((C1958<=E1958),\"X\",\"\")))","v":""},null,null,{"$f":"IF(ISBLANK(C1958),\"\",(IF((C1958>E1958),\"X\",\"\")))","v":""},null,null,"--"]
["Largura da Pista ",null,null,null,null,{"$f":"IF(ISBLANK(C1959),\"\",(IF((C1959<=E1959),\"X\",\"\")))","v":""},null,null,"",null,null,"--"]
["Largura da calçada",null,null,null,null,"",null,null,"",null,null,"--"]
["Largura do passeio",null,null,null,null,"",null,null,"",null,null,"--"]
["Ciclovia",null,null,null,null,"",null,null,"",null,null,"--"]
["Ciclofaixa",null,null,null,null,"",null,null,"",null,null,"--"]
[null,null,null,null,null,null,null,null,null,null,null,"--"]
["R19",{"$f":"IF(ISTEXT(VLOOKUP(A1965,'FICHA DE PROJETO'!$A$399:$I$579,2,FALSE)),VLOOKUP(A1965,'FICHA DE PROJETO'!$A$399:$I$579,2,FALSE),\"\")","v":""},null,null,null,null,null,null,null,null,null,{"$f":"IF((B1965=\"\"),\"--\",\"X\")","v":"--"}]
[null,null,"LEI",null,"PROJETO","ATENDEU À LEGISLAÇÃO",null,null,"NÃO ATENDEU À LEGISLAÇÃO",null,null,{"$f":"L1965","v":"--"}]
["Caracterização da Via: ",null,null,null,null,{"$f":"IF(ISBLANK(C1967),\"\",(IF((C1967=E1967),\"X\",\"\")))","v":""},null,null,{"$f":"IF(NOT(C1967=E1967),\"X\",\"\")","v":""},null,null,{"$f":"L1966","v":"--"}]
["Largura da Caixa da Via:",null,null,null,null,{"$f":"IF(ISBLANK(C1968),\"\",(IF((C1968<=E1968),\"X\",\"\")))","v":""},null,null,{"$f":"IF(ISBLANK(C1968),\"\",(IF((C1968>E1968),\"X\",\"\")))","v":""},null,null,"--"]
["Largura da Pista ",null,null,null,null,{"$f":"IF(ISBLANK(C1969),\"\",(IF((C1969<=E1969),\"X\",\"\")))","v":""},null,null,"",null,null,"--"]
["Largura da calçada",null,null,null,null,"",null,null,"",null,null,"--"]
["Largura do passeio",null,null,null,null,"",null,null,"",null,null,"--"]
["Ciclovia",null,null,null,null,"",null,null,"",null,null,"--"]
["Ciclofaixa",null,null,null,null,"",null,null,"",null,null,"--"]
[null,null,null,null,null,null,null,null,null,null,null,"--"]
["R20",{"$f":"IF(ISTEXT(VLOOKUP(A1975,'FICHA DE PROJETO'!$A$399:$I$579,2,FALSE)),VLOOKUP(A1975,'FICHA DE PROJETO'!$A$399:$I$579,2,FALSE),\"\")","v":""},null,null,null,null,null,null,null,null,null,{"$f":"IF((B1975=\"\"),\"--\",\"X\")","v":"--"}]
[null,null,"LEI",null,"PROJETO","ATENDEU À LEGISLAÇÃO",null,null,"NÃO ATENDEU À LEGISLAÇÃO",null,null,{"$f":"L1975","v":"--"}]
["Caracterização da Via: ",null,null,null,null,{"$f":"IF(ISBLANK(C1977),\"\",(IF((C1977=E1977),\"X\",\"\")))","v":""},null,null,{"$f":"IF(NOT(C1977=E1977),\"X\",\"\")","v":""},null,null,{"$f":"L1976","v":"--"}]
["Largura da Caixa da Via:",null,null,null,null,{"$f":"IF(ISBLANK(C1978),\"\",(IF((C1978<=E1978),\"X\",\"\")))","v":""},null,null,{"$f":"IF(ISBLANK(C1978),\"\",(IF((C1978>E1978),\"X\",\"\")))","v":""},null,null,"--"]
["Largura da Pista ",null,null,null,null,{"$f":"IF(ISBLANK(C1979),\"\",(IF((C1979<=E1979),\"X\",\"\")))","v":""},null,null,"",null,null,"--"]
["Largura da calçada",null,null,null,null,"",null,null,"",null,null,"--"]
["Largura do passeio",null,null,null,null,"",null,null,"",null,null,"--"]
["Ciclovia",null,null,null,null,"",null,null,"",null,null,"--"]
["Ciclofaixa",null,null,null,null,"",null,null,"",null,null,"--"]
[null,null,null,null,null,null,null,null,null,null,null,"--"]
["R21",{"$f":"IF(ISTEXT(VLOOKUP(A1985,'FICHA DE PROJETO'!$A$399:$I$579,2,FALSE)),VLOOKUP(A1985,'FICHA DE PROJETO'!$A$399:$I$579,2,FALSE),\"\")","v":""},null,null,null,null,null,null,null,null,null,{"$f":"IF((B1985=\"\"),\"--\",\"X\")","v":"--"}]
[null,null,"LEI",null,"PROJETO","ATENDEU À LEGISLAÇÃO",null,null,"NÃO ATENDEU À LEGISLAÇÃO",null,null,{"$f":"L1985","v":"--"}]
["Caracterização da Via: ",null,null,null,null,{"$f":"IF(ISBLANK(C1987),\"\",(IF((C1987=E1987),\"X\",\"\")))","v":""},null,null,{"$f":"IF(NOT(C1987=E1987),\"X\",\"\")","v":""},null,null,{"$f":"L1986","v":"--"}]
["Largura da Caixa da Via:",null,null,null,null,{"$f":"IF(ISBLANK(C1988),\"\",(IF((C1988<=E1988),\"X\",\"\")))","v":""},null,null,{"$f":"IF(ISBLANK(C1988),\"\",(IF((C1988>E1988),\"X\",\"\")))","v":""},null,null,"--"]
["Largura da Pista ",null,null,null,null,{"$f":"IF(ISBLANK(C1989),\"\",(IF((C1989<=E1989),\"X\",\"\")))","v":""},null,null,"",null,null,"--"]
["Largura da calçada",null,null,null,null,"",null,null,"",null,null,"--"]
["Largura do passeio",null,null,null,null,"",null,null,"",null,null,"--"]
["Ciclovia",null,null,null,null,"",null,null,"",null,null,"--"]
["Ciclofaixa",null,null,null,null,"",null,null,"",null,null,"--"]
[null,null,null,null,null,null,null,null,null,null,null,"--"]
["R22",{"$f":"IF(ISTEXT(VLOOKUP(A1995,'FICHA DE PROJETO'!$A$399:$I$579,2,FALSE)),VLOOKUP(A1995,'FICHA DE PROJETO'!$A$399:$I$579,2,FALSE),\"\")","v":""},null,null,null,null,null,null,null,null,null,{"$f":"IF((B1995=\"\"),\"--\",\"X\")","v":"--"}]
[null,null,"LEI",null,"PROJETO","ATENDEU À LEGISLAÇÃO",null,null,"NÃO ATENDEU À LEGISLAÇÃO",null,null,{"$f":"L1995","v":"--"}]
["Caracterização da Via: ",null,null,null,null,{"$f":"IF(ISBLANK(C1997),\"\",(IF((C1997=E1997),\"X\",\"\")))","v":""},null,null,{"$f":"IF(NOT(C1997=E1997),\"X\",\"\")","v":""},null,null,{"$f":"L1996","v":"--"}]
["Largura da Caixa da Via:",null,null,null,null,{"$f":"IF(ISBLANK(C1998),\"\",(IF((C1998<=E1998),\"X\",\"\")))","v":""},null,null,{"$f":"IF(ISBLANK(C1998),\"\",(IF((C1998>E1998),\"X\",\"\")))","v":""},null,null,"--"]
["Largura da Pista ",null,null,null,null,{"$f":"IF(ISBLANK(C1999),\"\",(IF((C1999<=E1999),\"X\",\"\")))","v":""},null,null,"",null,null,"--"]
["Largura da calçada",null,null,null,null,"",null,null,"",null,null,"--"]
["Largura do passeio",null,null,null,null,"",null,null,"",null,null,"--"]
["Ciclovia",null,null,null,null,"",null,null,"",null,null,"--"]
["Ciclofaixa",null,null,null,null,"",null,null,"",null,null,"--"]
[null,null,null,null,null,null,null,null,null,null,null,"--"]
["R23",{"$f":"IF(ISTEXT(VLOOKUP(A2005,'FICHA DE PROJETO'!$A$399:$I$579,2,FALSE)),VLOOKUP(A2005,'FICHA DE PROJETO'!$A$399:$I$579,2,FALSE),\"\")","v":""},null,null,null,null,null,null,null,null,null,{"$f":"IF((B2005=\"\"),\"--\",\"X\")","v":"--"}]
[null,null,"LEI",null,"PROJETO","ATENDEU À LEGISLAÇÃO",null,null,"NÃO ATENDEU À LEGISLAÇÃO",null,null,{"$f":"L2005","v":"--"}]
["Caracterização da Via: ",null,null,null,null,{"$f":"IF(ISBLANK(C2007),\"\",(IF((C2007=E2007),\"X\",\"\")))","v":""},null,null,{"$f":"IF(NOT(C2007=E2007),\"X\",\"\")","v":""},null,null,{"$f":"L2006","v":"--"}]
["Largura da Caixa da Via:",null,null,null,null,{"$f":"IF(ISBLANK(C2008),\"\",(IF((C2008<=E2008),\"X\",\"\")))","v":""},null,null,{"$f":"IF(ISBLANK(C2008),\"\",(IF((C2008>E2008),\"X\",\"\")))","v":""},null,null,"--"]
["Largura da Pista ",null,null,null,null,{"$f":"IF(ISBLANK(C2009),\"\",(IF((C2009<=E2009),\"X\",\"\")))","v":""},null,null,"",null,null,"--"]
["Largura da calçada",null,null,null,null,"",null,null,"",null,null,"--"]
["Largura do passeio",null,null,null,null,"",null,null,"",null,null,"--"]
["Ciclovia",null,null,null,null,"",null,null,"",null,null,"--"]
["Ciclofaixa",null,null,null,null,"",null,null,"",null,null,"--"]
[null,null,null,null,null,null,null,null,null,null,null,"--"]
["R24",{"$f":"IF(ISTEXT(VLOOKUP(A2015,'FICHA DE PROJETO'!$A$399:$I$579,2,FALSE)),VLOOKUP(A2015,'FICHA DE PROJETO'!$A$399:$I$579,2,FALSE),\"\")","v":""},null,null,null,null,null,null,null,null,null,{"$f":"IF((B2015=\"\"),\"--\",\"X\")","v":"--"}]
[null,null,"LEI",null,"PROJETO","ATENDEU À LEGISLAÇÃO",null,null,"NÃO ATENDEU À LEGISLAÇÃO",null,null,{"$f":"L2015","v":"--"}]
["Caracterização da Via: ",null,null,null,null,{"$f":"IF(ISBLANK(C2017),\"\",(IF((C2017=E2017),\"X\",\"\")))","v":""},null,null,{"$f":"IF(NOT(C2017=E2017),\"X\",\"\")","v":""},null,null,{"$f":"L2016","v":"--"}]
["Largura da Caixa da Via:",null,null,null,null,{"$f":"IF(ISBLANK(C2018),\"\",(IF((C2018<=E2018),\"X\",\"\")))","v":""},null,null,{"$f":"IF(ISBLANK(C2018),\"\",(IF((C2018>E2018),\"X\",\"\")))","v":""},null,null,"--"]
["Largura da Pista ",null,null,null,null,{"$f":"IF(ISBLANK(C2019),\"\",(IF((C2019<=E2019),\"X\",\"\")))","v":""},null,null,"",null,null,"--"]
["Largura da calçada",null,null,null,null,"",null,null,"",null,null,"--"]
["Largura do passeio",null,null,null,null,"",null,null,"",null,null,"--"]
["Ciclovia",null,null,null,null,"",null,null,"",null,null,"--"]
["Ciclofaixa",null,null,null,null,"",null,null,"",null,null,"--"]
[null,null,null,null,null,null,null,null,null,null,null,"--"]
["R25",{"$f":"IF(ISTEXT(VLOOKUP(A2025,'FICHA DE PROJETO'!$A$399:$I$579,2,FALSE)),VLOOKUP(A2025,'FICHA DE PROJETO'!$A$399:$I$579,2,FALSE),\"\")","v":""},null,null,null,null,null,null,null,null,null,{"$f":"IF((B2025=\"\"),\"--\",\"X\")","v":"--"}]
[null,null,"LEI",null,"PROJETO","ATENDEU À LEGISLAÇÃO",null,null,"NÃO ATENDEU À LEGISLAÇÃO",null,null,{"$f":"L2025","v":"--"}]
["Caracterização da Via: ",null,null,null,null,{"$f":"IF(ISBLANK(C2027),\"\",(IF((C2027=E2027),\"X\",\"\")))","v":""},null,null,{"$f":"IF(NOT(C2027=E2027),\"X\",\"\")","v":""},null,null,{"$f":"L2026","v":"--"}]
["Largura da Caixa da Via:",null,null,null,null,{"$f":"IF(ISBLANK(C2028),\"\",(IF((C2028<=E2028),\"X\",\"\")))","v":""},null,null,{"$f":"IF(ISBLANK(C2028),\"\",(IF((C2028>E2028),\"X\",\"\")))","v":""},null,null,"--"]
["Largura da Pista ",null,null,null,null,{"$f":"IF(ISBLANK(C2029),\"\",(IF((C2029<=E2029),\"X\",\"\")))","v":""},null,null,"",null,null,"--"]
["Largura da calçada",null,null,null,null,"",null,null,"",null,null,"--"]
["Largura do passeio",null,null,null,null,"",null,null,"",null,null,"--"]
["Ciclovia",null,null,null,null,"",null,null,"",null,null,"--"]
["Ciclofaixa",null,null,null,null,"",null,null,"",null,null,"--"]
[null,null,null,null,null,null,null,null,null,null,null,"--"]
["R26",{"$f":"IF(ISTEXT(VLOOKUP(A2035,'FICHA DE PROJETO'!$A$399:$I$579,2,FALSE)),VLOOKUP(A2035,'FICHA DE PROJETO'!$A$399:$I$579,2,FALSE),\"\")","v":""},null,null,null,null,null,null,null,null,null,{"$f":"IF((B2035=\"\"),\"--\",\"X\")","v":"--"}]
[null,null,"LEI",null,"PROJETO","ATENDEU À LEGISLAÇÃO",null,null,"NÃO ATENDEU À LEGISLAÇÃO",null,null,{"$f":"L2035","v":"--"}]
["Caracterização da Via: ",null,null,null,null,{"$f":"IF(ISBLANK(C2037),\"\",(IF((C2037=E2037),\"X\",\"\")))","v":""},null,null,{"$f":"IF(NOT(C2037=E2037),\"X\",\"\")","v":""},null,null,{"$f":"L2036","v":"--"}]
["Largura da Caixa da Via:",null,null,null,null,{"$f":"IF(ISBLANK(C2038),\"\",(IF((C2038<=E2038),\"X\",\"\")))","v":""},null,null,{"$f":"IF(ISBLANK(C2038),\"\",(IF((C2038>E2038),\"X\",\"\")))","v":""},null,null,"--"]
["Largura da Pista ",null,null,null,null,{"$f":"IF(ISBLANK(C2039),\"\",(IF((C2039<=E2039),\"X\",\"\")))","v":""},null,null,"",null,null,"--"]
["Largura da calçada",null,null,null,null,"",null,null,"",null,null,"--"]
["Largura do passeio",null,null,null,null,"",null,null,"",null,null,"--"]
["Ciclovia",null,null,null,null,"",null,null,"",null,null,"--"]
["Ciclofaixa",null,null,null,null,"",null,null,"",null,null,"--"]
[null,null,null,null,null,null,null,null,null,null,null,"--"]
["R27",{"$f":"IF(ISTEXT(VLOOKUP(A2045,'FICHA DE PROJETO'!$A$399:$I$579,2,FALSE)),VLOOKUP(A2045,'FICHA DE PROJETO'!$A$399:$I$579,2,FALSE),\"\")","v":""},null,null,null,null,null,null,null,null,null,{"$f":"IF((B2045=\"\"),\"--\",\"X\")","v":"--"}]
[null,null,"LEI",null,"PROJETO","ATENDEU À LEGISLAÇÃO",null,null,"NÃO ATENDEU À LEGISLAÇÃO",null,null,{"$f":"L2045","v":"--"}]
["Caracterização da Via: ",null,null,null,null,{"$f":"IF(ISBLANK(C2047),\"\",(IF((C2047=E2047),\"X\",\"\")))","v":""},null,null,{"$f":"IF(NOT(C2047=E2047),\"X\",\"\")","v":""},null,null,{"$f":"L2046","v":"--"}]
["Largura da Caixa da Via:",null,null,null,null,{"$f":"IF(ISBLANK(C2048),\"\",(IF((C2048<=E2048),\"X\",\"\")))","v":""},null,null,{"$f":"IF(ISBLANK(C2048),\"\",(IF((C2048>E2048),\"X\",\"\")))","v":""},null,null,"--"]
["Largura da Pista ",null,null,null,null,{"$f":"IF(ISBLANK(C2049),\"\",(IF((C2049<=E2049),\"X\",\"\")))","v":""},null,null,"",null,null,"--"]
["Largura da calçada",null,null,null,null,"",null,null,"",null,null,"--"]
["Largura do passeio",null,null,null,null,"",null,null,"",null,null,"--"]
["Ciclovia",null,null,null,null,"",null,null,"",null,null,"--"]
["Ciclofaixa",null,null,null,null,"",null,null,"",null,null,"--"]
[null,null,null,null,null,null,null,null,null,null,null,"--"]
["R28",{"$f":"IF(ISTEXT(VLOOKUP(A2055,'FICHA DE PROJETO'!$A$399:$I$579,2,FALSE)),VLOOKUP(A2055,'FICHA DE PROJETO'!$A$399:$I$579,2,FALSE),\"\")","v":""},null,null,null,null,null,null,null,null,null,{"$f":"IF((B2055=\"\"),\"--\",\"X\")","v":"--"}]
[null,null,"LEI",null,"PROJETO","ATENDEU À LEGISLAÇÃO",null,null,"NÃO ATENDEU À LEGISLAÇÃO",null,null,{"$f":"L2055","v":"--"}]
["Caracterização da Via: ",null,null,null,null,{"$f":"IF(ISBLANK(C2057),\"\",(IF((C2057=E2057),\"X\",\"\")))","v":""},null,null,{"$f":"IF(NOT(C2057=E2057),\"X\",\"\")","v":""},null,null,{"$f":"L2056","v":"--"}]
["Largura da Caixa da Via:",null,null,null,null,{"$f":"IF(ISBLANK(C2058),\"\",(IF((C2058<=E2058),\"X\",\"\")))","v":""},null,null,{"$f":"IF(ISBLANK(C2058),\"\",(IF((C2058>E2058),\"X\",\"\")))","v":""},null,null,"--"]
["Largura da Pista ",null,null,null,null,{"$f":"IF(ISBLANK(C2059),\"\",(IF((C2059<=E2059),\"X\",\"\")))","v":""},null,null,"",null,null,"--"]
["Largura da calçada",null,null,null,null,"",null,null,"",null,null,"--"]
["Largura do passeio",null,null,null,null,"",null,null,"",null,null,"--"]
["Ciclovia",null,null,null,null,"",null,null,"",null,null,"--"]
["Ciclofaixa",null,null,null,null,"",null,null,"",null,null,"--"]
[null,null,null,null,null,null,null,null,null,null,null,"--"]
["R29",{"$f":"IF(ISTEXT(VLOOKUP(A2065,'FICHA DE PROJETO'!$A$399:$I$579,2,FALSE)),VLOOKUP(A2065,'FICHA DE PROJETO'!$A$399:$I$579,2,FALSE),\"\")","v":""},null,null,null,null,null,null,null,null,null,{"$f":"IF((B2065=\"\"),\"--\",\"X\")","v":"--"}]
[null,null,"LEI",null,"PROJETO","ATENDEU À LEGISLAÇÃO",null,null,"NÃO ATENDEU À LEGISLAÇÃO",null,null,{"$f":"L2065","v":"--"}]
["Caracterização da Via: ",null,null,null,null,{"$f":"IF(ISBLANK(C2067),\"\",(IF((C2067=E2067),\"X\",\"\")))","v":""},null,null,{"$f":"IF(NOT(C2067=E2067),\"X\",\"\")","v":""},null,null,{"$f":"L2066","v":"--"}]
["Largura da Caixa da Via:",null,null,null,null,{"$f":"IF(ISBLANK(C2068),\"\",(IF((C2068<=E2068),\"X\",\"\")))","v":""},null,null,{"$f":"IF(ISBLANK(C2068),\"\",(IF((C2068>E2068),\"X\",\"\")))","v":""},null,null,"--"]
["Largura da Pista ",null,null,null,null,{"$f":"IF(ISBLANK(C2069),\"\",(IF((C2069<=E2069),\"X\",\"\")))","v":""},null,null,"",null,null,"--"]
["Largura da calçada",null,null,null,null,"",null,null,"",null,null,"--"]
["Largura do passeio",null,null,null,null,"",null,null,"",null,null,"--"]
["Ciclovia",null,null,null,null,"",null,null,"",null,null,"--"]
["Ciclofaixa",null,null,null,null,"",null,null,"",null,null,"--"]
[null,null,null,null,null,null,null,null,null,null,null,"--"]
["R30",{"$f":"IF(ISTEXT(VLOOKUP(A2075,'FICHA DE PROJETO'!$A$399:$I$579,2,FALSE)),VLOOKUP(A2075,'FICHA DE PROJETO'!$A$399:$I$579,2,FALSE),\"\")","v":""},null,null,null,null,null,null,null,null,null,{"$f":"IF((B2075=\"\"),\"--\",\"X\")","v":"--"}]
[null,null,"LEI",null,"PROJETO","ATENDEU À LEGISLAÇÃO",null,null,"NÃO ATENDEU À LEGISLAÇÃO",null,null,{"$f":"L2075","v":"--"}]
["Caracterização da Via: ",null,null,null,null,{"$f":"IF(ISBLANK(C2077),\"\",(IF((C2077=E2077),\"X\",\"\")))","v":""},null,null,{"$f":"IF(NOT(C2077=E2077),\"X\",\"\")","v":""},null,null,{"$f":"L2076","v":"--"}]
["Largura da Caixa da Via:",null,null,null,null,{"$f":"IF(ISBLANK(C2078),\"\",(IF((C2078<=E2078),\"X\",\"\")))","v":""},null,null,{"$f":"IF(ISBLANK(C2078),\"\",(IF((C2078>E2078),\"X\",\"\")))","v":""},null,null,"--"]
["Largura da Pista ",null,null,null,null,{"$f":"IF(ISBLANK(C2079),\"\",(IF((C2079<=E2079),\"X\",\"\")))","v":""},null,null,"",null,null,"--"]
["Largura da calçada",null,null,null,null,"",null,null,"",null,null,"--"]
["Largura do passeio",null,null,null,null,"",null,null,"",null,null,"--"]
["Ciclovia",null,null,null,null,"",null,null,"",null,null,"--"]
["Ciclofaixa",null,null,null,null,"",null,null,"",null,null,"--"]
[null,null,null,null,null,null,null,null,null,null,null,"--"]
["R31",{"$f":"IF(ISTEXT(VLOOKUP(A2085,'FICHA DE PROJETO'!$A$399:$I$579,2,FALSE)),VLOOKUP(A2085,'FICHA DE PROJETO'!$A$399:$I$579,2,FALSE),\"\")","v":""},null,null,null,null,null,null,null,null,null,{"$f":"IF((B2085=\"\"),\"--\",\"X\")","v":"--"}]
[null,null,"LEI",null,"PROJETO","ATENDEU À LEGISLAÇÃO",null,null,"NÃO ATENDEU À LEGISLAÇÃO",null,null,{"$f":"L2085","v":"--"}]
["Caracterização da Via: ",null,null,null,null,{"$f":"IF(ISBLANK(C2087),\"\",(IF((C2087=E2087),\"X\",\"\")))","v":""},null,null,{"$f":"IF(NOT(C2087=E2087),\"X\",\"\")","v":""},null,null,{"$f":"L2086","v":"--"}]
["Largura da Caixa da Via:",null,null,null,null,{"$f":"IF(ISBLANK(C2088),\"\",(IF((C2088<=E2088),\"X\",\"\")))","v":""},null,null,{"$f":"IF(ISBLANK(C2088),\"\",(IF((C2088>E2088),\"X\",\"\")))","v":""},null,null,"--"]
["Largura da Pista ",null,null,null,null,{"$f":"IF(ISBLANK(C2089),\"\",(IF((C2089<=E2089),\"X\",\"\")))","v":""},null,null,"",null,null,"--"]
["Largura da calçada",null,null,null,null,"",null,null,"",null,null,"--"]
["Largura do passeio",null,null,null,null,"",null,null,"",null,null,"--"]
["Ciclovia",null,null,null,null,"",null,null,"",null,null,"--"]
["Ciclofaixa",null,null,null,null,"",null,null,"",null,null,"--"]
[null,null,null,null,null,null,null,null,null,null,null,"--"]
["R32",{"$f":"IF(ISTEXT(VLOOKUP(A2095,'FICHA DE PROJETO'!$A$399:$I$579,2,FALSE)),VLOOKUP(A2095,'FICHA DE PROJETO'!$A$399:$I$579,2,FALSE),\"\")","v":""},null,null,null,null,null,null,null,null,null,{"$f":"IF((B2095=\"\"),\"--\",\"X\")","v":"--"}]
[null,null,"LEI",null,"PROJETO","ATENDEU À LEGISLAÇÃO",null,null,"NÃO ATENDEU À LEGISLAÇÃO",null,null,{"$f":"L2095","v":"--"}]
["Caracterização da Via: ",null,null,null,null,{"$f":"IF(ISBLANK(C2097),\"\",(IF((C2097=E2097),\"X\",\"\")))","v":""},null,null,{"$f":"IF(NOT(C2097=E2097),\"X\",\"\")","v":""},null,null,{"$f":"L2096","v":"--"}]
["Largura da Caixa da Via:",null,null,null,null,{"$f":"IF(ISBLANK(C2098),\"\",(IF((C2098<=E2098),\"X\",\"\")))","v":""},null,null,{"$f":"IF(ISBLANK(C2098),\"\",(IF((C2098>E2098),\"X\",\"\")))","v":""},null,null,"--"]
["Largura da Pista ",null,null,null,null,{"$f":"IF(ISBLANK(C2099),\"\",(IF((C2099<=E2099),\"X\",\"\")))","v":""},null,null,"",null,null,"--"]
["Largura da calçada",null,null,null,null,"",null,null,"",null,null,"--"]
["Largura do passeio",null,null,null,null,"",null,null,"",null,null,"--"]
["Ciclovia",null,null,null,null,"",null,null,"",null,null,"--"]
["Ciclofaixa",null,null,null,null,"",null,null,"",null,null,"--"]
[null,null,null,null,null,null,null,null,null,null,null,"--"]
["R33",{"$f":"IF(ISTEXT(VLOOKUP(A2105,'FICHA DE PROJETO'!$A$399:$I$579,2,FALSE)),VLOOKUP(A2105,'FICHA DE PROJETO'!$A$399:$I$579,2,FALSE),\"\")","v":""},null,null,null,null,null,null,null,null,null,{"$f":"IF((B2105=\"\"),\"--\",\"X\")","v":"--"}]
[null,null,"LEI",null,"PROJETO","ATENDEU À LEGISLAÇÃO",null,null,"NÃO ATENDEU À LEGISLAÇÃO",null,null,{"$f":"L2105","v":"--"}]
["Caracterização da Via: ",null,null,null,null,{"$f":"IF(ISBLANK(C2107),\"\",(IF((C2107=E2107),\"X\",\"\")))","v":""},null,null,{"$f":"IF(NOT(C2107=E2107),\"X\",\"\")","v":""},null,null,{"$f":"L2106","v":"--"}]
["Largura da Caixa da Via:",null,null,null,null,{"$f":"IF(ISBLANK(C2108),\"\",(IF((C2108<=E2108),\"X\",\"\")))","v":""},null,null,{"$f":"IF(ISBLANK(C2108),\"\",(IF((C2108>E2108),\"X\",\"\")))","v":""},null,null,"--"]
["Largura da Pista ",null,null,null,null,{"$f":"IF(ISBLANK(C2109),\"\",(IF((C2109<=E2109),\"X\",\"\")))","v":""},null,null,"",null,null,"--"]
["Largura da calçada",null,null,null,null,"",null,null,"",null,null,"--"]
["Largura do passeio",null,null,null,null,"",null,null,"",null,null,"--"]
["Ciclovia",null,null,null,null,"",null,null,"",null,null,"--"]
["Ciclofaixa",null,null,null,null,"",null,null,"",null,null,"--"]
[null,null,null,null,null,null,null,null,null,null,null,"--"]
["R34",{"$f":"IF(ISTEXT(VLOOKUP(A2115,'FICHA DE PROJETO'!$A$399:$I$579,2,FALSE)),VLOOKUP(A2115,'FICHA DE PROJETO'!$A$399:$I$579,2,FALSE),\"\")","v":""},null,null,null,null,null,null,null,null,null,{"$f":"IF((B2115=\"\"),\"--\",\"X\")","v":"--"}]
[null,null,"LEI",null,"PROJETO","ATENDEU À LEGISLAÇÃO",null,null,"NÃO ATENDEU À LEGISLAÇÃO",null,null,{"$f":"L2115","v":"--"}]
["Caracterização da Via: ",null,null,null,null,{"$f":"IF(ISBLANK(C2117),\"\",(IF((C2117=E2117),\"X\",\"\")))","v":""},null,null,{"$f":"IF(NOT(C2117=E2117),\"X\",\"\")","v":""},null,null,{"$f":"L2116","v":"--"}]
["Largura da Caixa da Via:",null,null,null,null,{"$f":"IF(ISBLANK(C2118),\"\",(IF((C2118<=E2118),\"X\",\"\")))","v":""},null,null,{"$f":"IF(ISBLANK(C2118),\"\",(IF((C2118>E2118),\"X\",\"\")))","v":""},null,null,"--"]
["Largura da Pista ",null,null,null,null,{"$f":"IF(ISBLANK(C2119),\"\",(IF((C2119<=E2119),\"X\",\"\")))","v":""},null,null,"",null,null,"--"]
["Largura da calçada",null,null,null,null,"",null,null,"",null,null,"--"]
["Largura do passeio",null,null,null,null,"",null,null,"",null,null,"--"]
["Ciclovia",null,null,null,null,"",null,null,"",null,null,"--"]
["Ciclofaixa",null,null,null,null,"",null,null,"",null,null,"--"]
[null,null,null,null,null,null,null,null,null,null,null,"--"]
["R35",{"$f":"IF(ISTEXT(VLOOKUP(A2125,'FICHA DE PROJETO'!$A$399:$I$579,2,FALSE)),VLOOKUP(A2125,'FICHA DE PROJETO'!$A$399:$I$579,2,FALSE),\"\")","v":""},null,null,null,null,null,null,null,null,null,{"$f":"IF((B2125=\"\"),\"--\",\"X\")","v":"--"}]
[null,null,"LEI",null,"PROJETO","ATENDEU À LEGISLAÇÃO",null,null,"NÃO ATENDEU À LEGISLAÇÃO",null,null,{"$f":"L2125","v":"--"}]
["Caracterização da Via: ",null,null,null,null,{"$f":"IF(ISBLANK(C2127),\"\",(IF((C2127=E2127),\"X\",\"\")))","v":""},null,null,{"$f":"IF(NOT(C2127=E2127),\"X\",\"\")","v":""},null,null,{"$f":"L2126","v":"--"}]
["Largura da Caixa da Via:",null,null,null,null,{"$f":"IF(ISBLANK(C2128),\"\",(IF((C2128<=E2128),\"X\",\"\")))","v":""},null,null,{"$f":"IF(ISBLANK(C2128),\"\",(IF((C2128>E2128),\"X\",\"\")))","v":""},null,null,"--"]
["Largura da Pista ",null,null,null,null,{"$f":"IF(ISBLANK(C2129),\"\",(IF((C2129<=E2129),\"X\",\"\")))","v":""},null,null,"",null,null,"--"]
["Largura da calçada",null,null,null,null,"",null,null,"",null,null,"--"]
["Largura do passeio",null,null,null,null,"",null,null,"",null,null,"--"]
["Ciclovia",null,null,null,null,"",null,null,"",null,null,"--"]
["Ciclofaixa",null,null,null,null,"",null,null,"",null,null,"--"]
[null,null,null,null,null,null,null,null,null,null,null,"--"]
["R36",{"$f":"IF(ISTEXT(VLOOKUP(A2135,'FICHA DE PROJETO'!$A$399:$I$579,2,FALSE)),VLOOKUP(A2135,'FICHA DE PROJETO'!$A$399:$I$579,2,FALSE),\"\")","v":""},null,null,null,null,null,null,null,null,null,{"$f":"IF((B2135=\"\"),\"--\",\"X\")","v":"--"}]
[null,null,"LEI",null,"PROJETO","ATENDEU À LEGISLAÇÃO",null,null,"NÃO ATENDEU À LEGISLAÇÃO",null,null,{"$f":"L2135","v":"--"}]
["Caracterização da Via: ",null,null,null,null,{"$f":"IF(ISBLANK(C2137),\"\",(IF((C2137=E2137),\"X\",\"\")))","v":""},null,null,{"$f":"IF(NOT(C2137=E2137),\"X\",\"\")","v":""},null,null,{"$f":"L2136","v":"--"}]
["Largura da Caixa da Via:",null,null,null,null,{"$f":"IF(ISBLANK(C2138),\"\",(IF((C2138<=E2138),\"X\",\"\")))","v":""},null,null,{"$f":"IF(ISBLANK(C2138),\"\",(IF((C2138>E2138),\"X\",\"\")))","v":""},null,null,"--"]
["Largura da Pista ",null,null,null,null,{"$f":"IF(ISBLANK(C2139),\"\",(IF((C2139<=E2139),\"X\",\"\")))","v":""},null,null,"",null,null,"--"]
["Largura da calçada",null,null,null,null,"",null,null,"",null,null,"--"]
["Largura do passeio",null,null,null,null,"",null,null,"",null,null,"--"]
["Ciclovia",null,null,null,null,"",null,null,"",null,null,"--"]
["Ciclofaixa",null,null,null,null,"",null,null,"",null,null,"--"]
[null,null,null,null,null,null,null,null,null,null,null,"--"]
["R37",{"$f":"IF(ISTEXT(VLOOKUP(A2145,'FICHA DE PROJETO'!$A$399:$I$579,2,FALSE)),VLOOKUP(A2145,'FICHA DE PROJETO'!$A$399:$I$579,2,FALSE),\"\")","v":""},null,null,null,null,null,null,null,null,null,{"$f":"IF((B2145=\"\"),\"--\",\"X\")","v":"--"}]
[null,null,"LEI",null,"PROJETO","ATENDEU À LEGISLAÇÃO",null,null,"NÃO ATENDEU À LEGISLAÇÃO",null,null,{"$f":"L2145","v":"--"}]
["Caracterização da Via: ",null,null,null,null,{"$f":"IF(ISBLANK(C2147),\"\",(IF((C2147=E2147),\"X\",\"\")))","v":""},null,null,{"$f":"IF(NOT(C2147=E2147),\"X\",\"\")","v":""},null,null,{"$f":"L2146","v":"--"}]
["Largura da Caixa da Via:",null,null,null,null,{"$f":"IF(ISBLANK(C2148),\"\",(IF((C2148<=E2148),\"X\",\"\")))","v":""},null,null,{"$f":"IF(ISBLANK(C2148),\"\",(IF((C2148>E2148),\"X\",\"\")))","v":""},null,null,"--"]
["Largura da Pista ",null,null,null,null,{"$f":"IF(ISBLANK(C2149),\"\",(IF((C2149<=E2149),\"X\",\"\")))","v":""},null,null,"",null,null,"--"]
["Largura da calçada",null,null,null,null,"",null,null,"",null,null,"--"]
["Largura do passeio",null,null,null,null,"",null,null,"",null,null,"--"]
["Ciclovia",null,null,null,null,"",null,null,"",null,null,"--"]
["Ciclofaixa",null,null,null,null,"",null,null,"",null,null,"--"]
[null,null,null,null,null,null,null,null,null,null,null,"--"]
["R38",{"$f":"IF(ISTEXT(VLOOKUP(A2155,'FICHA DE PROJETO'!$A$399:$I$579,2,FALSE)),VLOOKUP(A2155,'FICHA DE PROJETO'!$A$399:$I$579,2,FALSE),\"\")","v":""},null,null,null,null,null,null,null,null,null,{"$f":"IF((B2155=\"\"),\"--\",\"X\")","v":"--"}]
[null,null,"LEI",null,"PROJETO","ATENDEU À LEGISLAÇÃO",null,null,"NÃO ATENDEU À LEGISLAÇÃO",null,null,{"$f":"L2155","v":"--"}]
["Caracterização da Via: ",null,null,null,null,{"$f":"IF(ISBLANK(C2157),\"\",(IF((C2157=E2157),\"X\",\"\")))","v":""},null,null,{"$f":"IF(NOT(C2157=E2157),\"X\",\"\")","v":""},null,null,{"$f":"L2156","v":"--"}]
["Largura da Caixa da Via:",null,null,null,null,{"$f":"IF(ISBLANK(C2158),\"\",(IF((C2158<=E2158),\"X\",\"\")))","v":""},null,null,{"$f":"IF(ISBLANK(C2158),\"\",(IF((C2158>E2158),\"X\",\"\")))","v":""},null,null,"--"]
["Largura da Pista ",null,null,null,null,{"$f":"IF(ISBLANK(C2159),\"\",(IF((C2159<=E2159),\"X\",\"\")))","v":""},null,null,"",null,null,"--"]
["Largura da calçada",null,null,null,null,"",null,null,"",null,null,"--"]
["Largura do passeio",null,null,null,null,"",null,null,"",null,null,"--"]
["Ciclovia",null,null,null,null,"",null,null,"",null,null,"--"]
["Ciclofaixa",null,null,null,null,"",null,null,"",null,null,"--"]
[null,null,null,null,null,null,null,null,null,null,null,"--"]
["R39",{"$f":"IF(ISTEXT(VLOOKUP(A2165,'FICHA DE PROJETO'!$A$399:$I$579,2,FALSE)),VLOOKUP(A2165,'FICHA DE PROJETO'!$A$399:$I$579,2,FALSE),\"\")","v":""},null,null,null,null,null,null,null,null,null,{"$f":"IF((B2165=\"\"),\"--\",\"X\")","v":"--"}]
[null,null,"LEI",null,"PROJETO","ATENDEU À LEGISLAÇÃO",null,null,"NÃO ATENDEU À LEGISLAÇÃO",null,null,{"$f":"L2165","v":"--"}]
["Caracterização da Via: ",null,null,null,null,{"$f":"IF(ISBLANK(C2167),\"\",(IF((C2167=E2167),\"X\",\"\")))","v":""},null,null,{"$f":"IF(NOT(C2167=E2167),\"X\",\"\")","v":""},null,null,{"$f":"L2166","v":"--"}]
["Largura da Caixa da Via:",null,null,null,null,{"$f":"IF(ISBLANK(C2168),\"\",(IF((C2168<=E2168),\"X\",\"\")))","v":""},null,null,{"$f":"IF(ISBLANK(C2168),\"\",(IF((C2168>E2168),\"X\",\"\")))","v":""},null,null,"--"]
["Largura da Pista ",null,null,null,null,{"$f":"IF(ISBLANK(C2169),\"\",(IF((C2169<=E2169),\"X\",\"\")))","v":""},null,null,"",null,null,"--"]
["Largura da calçada",null,null,null,null,"",null,null,"",null,null,"--"]
["Largura do passeio",null,null,null,null,"",null,null,"",null,null,"--"]
["Ciclovia",null,null,null,null,"",null,null,"",null,null,"--"]
["Ciclofaixa",null,null,null,null,"",null,null,"",null,null,"--"]
[null,null,null,null,null,null,null,null,null,null,null,"--"]
["R40",{"$f":"IF(ISTEXT(VLOOKUP(A2175,'FICHA DE PROJETO'!$A$399:$I$579,2,FALSE)),VLOOKUP(A2175,'FICHA DE PROJETO'!$A$399:$I$579,2,FALSE),\"\")","v":""},null,null,null,null,null,null,null,null,null,{"$f":"IF((B2175=\"\"),\"--\",\"X\")","v":"--"}]
[null,null,"LEI",null,"PROJETO","ATENDEU À LEGISLAÇÃO",null,null,"NÃO ATENDEU À LEGISLAÇÃO",null,null,{"$f":"L2175","v":"--"}]
["Caracterização da Via: ",null,null,null,null,{"$f":"IF(ISBLANK(C2177),\"\",(IF((C2177=E2177),\"X\",\"\")))","v":""},null,null,{"$f":"IF(NOT(C2177=E2177),\"X\",\"\")","v":""},null,null,{"$f":"L2176","v":"--"}]
["Largura da Caixa da Via:",null,null,null,null,{"$f":"IF(ISBLANK(C2178),\"\",(IF((C2178<=E2178),\"X\",\"\")))","v":""},null,null,{"$f":"IF(ISBLANK(C2178),\"\",(IF((C2178>E2178),\"X\",\"\")))","v":""},null,null,"--"]
["Largura da Pista ",null,null,null,null,{"$f":"IF(ISBLANK(C2179),\"\",(IF((C2179<=E2179),\"X\",\"\")))","v":""},null,null,"",null,null,"--"]
["Largura da calçada",null,null,null,null,"",null,null,"",null,null,"--"]
["Largura do passeio",null,null,null,null,"",null,null,"",null,null,"--"]
["Ciclovia",null,null,null,null,"",null,null,"",null,null,"--"]
["Ciclofaixa",null,null,null,null,"",null,null,"",null,null,"--"]
[null,null,null,null,null,null,null,null,null,null,null,"--"]
["R41",{"$f":"IF(ISTEXT(VLOOKUP(A2185,'FICHA DE PROJETO'!$A$399:$I$579,2,FALSE)),VLOOKUP(A2185,'FICHA DE PROJETO'!$A$399:$I$579,2,FALSE),\"\")","v":""},null,null,null,null,null,null,null,null,null,{"$f":"IF((B2185=\"\"),\"--\",\"X\")","v":"--"}]
[null,null,"LEI",null,"PROJETO","ATENDEU À LEGISLAÇÃO",null,null,"NÃO ATENDEU À LEGISLAÇÃO",null,null,{"$f":"L2185","v":"--"}]
["Caracterização da Via: ",null,null,null,null,{"$f":"IF(ISBLANK(C2187),\"\",(IF((C2187=E2187),\"X\",\"\")))","v":""},null,null,{"$f":"IF(NOT(C2187=E2187),\"X\",\"\")","v":""},null,null,{"$f":"L2186","v":"--"}]
["Largura da Caixa da Via:",null,null,null,null,{"$f":"IF(ISBLANK(C2188),\"\",(IF((C2188<=E2188),\"X\",\"\")))","v":""},null,null,{"$f":"IF(ISBLANK(C2188),\"\",(IF((C2188>E2188),\"X\",\"\")))","v":""},null,null,"--"]
["Largura da Pista ",null,null,null,null,{"$f":"IF(ISBLANK(C2189),\"\",(IF((C2189<=E2189),\"X\",\"\")))","v":""},null,null,"",null,null,"--"]
["Largura da calçada",null,null,null,null,"",null,null,"",null,null,"--"]
["Largura do passeio",null,null,null,null,"",null,null,"",null,null,"--"]
["Ciclovia",null,null,null,null,"",null,null,"",null,null,"--"]
["Ciclofaixa",null,null,null,null,"",null,null,"",null,null,"--"]
[null,null,null,null,null,null,null,null,null,null,null,"--"]
["R42",{"$f":"IF(ISTEXT(VLOOKUP(A2195,'FICHA DE PROJETO'!$A$399:$I$579,2,FALSE)),VLOOKUP(A2195,'FICHA DE PROJETO'!$A$399:$I$579,2,FALSE),\"\")","v":""},null,null,null,null,null,null,null,null,null,{"$f":"IF((B2195=\"\"),\"--\",\"X\")","v":"--"}]
[null,null,"LEI",null,"PROJETO","ATENDEU À LEGISLAÇÃO",null,null,"NÃO ATENDEU À LEGISLAÇÃO",null,null,{"$f":"L2195","v":"--"}]
["Caracterização da Via: ",null,null,null,null,{"$f":"IF(ISBLANK(C2197),\"\",(IF((C2197=E2197),\"X\",\"\")))","v":""},null,null,{"$f":"IF(NOT(C2197=E2197),\"X\",\"\")","v":""},null,null,{"$f":"L2196","v":"--"}]
["Largura da Caixa da Via:",null,null,null,null,{"$f":"IF(ISBLANK(C2198),\"\",(IF((C2198<=E2198),\"X\",\"\")))","v":""},null,null,{"$f":"IF(ISBLANK(C2198),\"\",(IF((C2198>E2198),\"X\",\"\")))","v":""},null,null,"--"]
["Largura da Pista ",null,null,null,null,{"$f":"IF(ISBLANK(C2199),\"\",(IF((C2199<=E2199),\"X\",\"\")))","v":""},null,null,"",null,null,"--"]
["Largura da calçada",null,null,null,null,"",null,null,"",null,null,"--"]
["Largura do passeio",null,null,null,null,"",null,null,"",null,null,"--"]
["Ciclovia",null,null,null,null,"",null,null,"",null,null,"--"]
["Ciclofaixa",null,null,null,null,"",null,null,"",null,null,"--"]
[null,null,null,null,null,null,null,null,null,null,null,"--"]
["R43",{"$f":"IF(ISTEXT(VLOOKUP(A2205,'FICHA DE PROJETO'!$A$399:$I$579,2,FALSE)),VLOOKUP(A2205,'FICHA DE PROJETO'!$A$399:$I$579,2,FALSE),\"\")","v":""},null,null,null,null,null,null,null,null,null,{"$f":"IF((B2205=\"\"),\"--\",\"X\")","v":"--"}]
[null,null,"LEI",null,"PROJETO","ATENDEU À LEGISLAÇÃO",null,null,"NÃO ATENDEU À LEGISLAÇÃO",null,null,{"$f":"L2205","v":"--"}]
["Caracterização da Via: ",null,null,null,null,{"$f":"IF(ISBLANK(C2207),\"\",(IF((C2207=E2207),\"X\",\"\")))","v":""},null,null,{"$f":"IF(NOT(C2207=E2207),\"X\",\"\")","v":""},null,null,{"$f":"L2206","v":"--"}]
["Largura da Caixa da Via:",null,null,null,null,{"$f":"IF(ISBLANK(C2208),\"\",(IF((C2208<=E2208),\"X\",\"\")))","v":""},null,null,{"$f":"IF(ISBLANK(C2208),\"\",(IF((C2208>E2208),\"X\",\"\")))","v":""},null,null,"--"]
["Largura da Pista ",null,null,null,null,{"$f":"IF(ISBLANK(C2209),\"\",(IF((C2209<=E2209),\"X\",\"\")))","v":""},null,null,"",null,null,"--"]
["Largura da calçada",null,null,null,null,"",null,null,"",null,null,"--"]
["Largura do passeio",null,null,null,null,"",null,null,"",null,null,"--"]
["Ciclovia",null,null,null,null,"",null,null,"",null,null,"--"]
["Ciclofaixa",null,null,null,null,"",null,null,"",null,null,"--"]
[null,null,null,null,null,null,null,null,null,null,null,"--"]
["R44",{"$f":"IF(ISTEXT(VLOOKUP(A2215,'FICHA DE PROJETO'!$A$399:$I$579,2,FALSE)),VLOOKUP(A2215,'FICHA DE PROJETO'!$A$399:$I$579,2,FALSE),\"\")","v":""},null,null,null,null,null,null,null,null,null,{"$f":"IF((B2215=\"\"),\"--\",\"X\")","v":"--"}]
[null,null,"LEI",null,"PROJETO","ATENDEU À LEGISLAÇÃO",null,null,"NÃO ATENDEU À LEGISLAÇÃO",null,null,{"$f":"L2215","v":"--"}]
["Caracterização da Via: ",null,null,null,null,{"$f":"IF(ISBLANK(C2217),\"\",(IF((C2217=E2217),\"X\",\"\")))","v":""},null,null,{"$f":"IF(NOT(C2217=E2217),\"X\",\"\")","v":""},null,null,{"$f":"L2216","v":"--"}]
["Largura da Caixa da Via:",null,null,null,null,{"$f":"IF(ISBLANK(C2218),\"\",(IF((C2218<=E2218),\"X\",\"\")))","v":""},null,null,{"$f":"IF(ISBLANK(C2218),\"\",(IF((C2218>E2218),\"X\",\"\")))","v":""},null,null,"--"]
["Largura da Pista ",null,null,null,null,{"$f":"IF(ISBLANK(C2219),\"\",(IF((C2219<=E2219),\"X\",\"\")))","v":""},null,null,"",null,null,"--"]
["Largura da calçada",null,null,null,null,"",null,null,"",null,null,"--"]
["Largura do passeio",null,null,null,null,"",null,null,"",null,null,"--"]
["Ciclovia",null,null,null,null,"",null,null,"",null,null,"--"]
["Ciclofaixa",null,null,null,null,"",null,null,"",null,null,"--"]
[null,null,null,null,null,null,null,null,null,null,null,"--"]
["R45",{"$f":"IF(ISTEXT(VLOOKUP(A2225,'FICHA DE PROJETO'!$A$399:$I$579,2,FALSE)),VLOOKUP(A2225,'FICHA DE PROJETO'!$A$399:$I$579,2,FALSE),\"\")","v":""},null,null,null,null,null,null,null,null,null,{"$f":"IF((B2225=\"\"),\"--\",\"X\")","v":"--"}]
[null,null,"LEI",null,"PROJETO","ATENDEU À LEGISLAÇÃO",null,null,"NÃO ATENDEU À LEGISLAÇÃO",null,null,{"$f":"L2225","v":"--"}]
["Caracterização da Via: ",null,null,null,null,{"$f":"IF(ISBLANK(C2227),\"\",(IF((C2227=E2227),\"X\",\"\")))","v":""},null,null,{"$f":"IF(NOT(C2227=E2227),\"X\",\"\")","v":""},null,null,{"$f":"L2226","v":"--"}]
["Largura da Caixa da Via:",null,null,null,null,{"$f":"IF(ISBLANK(C2228),\"\",(IF((C2228<=E2228),\"X\",\"\")))","v":""},null,null,{"$f":"IF(ISBLANK(C2228),\"\",(IF((C2228>E2228),\"X\",\"\")))","v":""},null,null,"--"]
["Largura da Pista ",null,null,null,null,{"$f":"IF(ISBLANK(C2229),\"\",(IF((C2229<=E2229),\"X\",\"\")))","v":""},null,null,"",null,null,"--"]
["Largura da calçada",null,null,null,null,"",null,null,"",null,null,"--"]
["Largura do passeio",null,null,null,null,"",null,null,"",null,null,"--"]
["Ciclovia",null,null,null,null,"",null,null,"",null,null,"--"]
["Ciclofaixa",null,null,null,null,"",null,null,"",null,null,"--"]
[null,null,null,null,null,null,null,null,null,null,null,"--"]
["R46",{"$f":"IF(ISTEXT(VLOOKUP(A2235,'FICHA DE PROJETO'!$A$399:$I$579,2,FALSE)),VLOOKUP(A2235,'FICHA DE PROJETO'!$A$399:$I$579,2,FALSE),\"\")","v":""},null,null,null,null,null,null,null,null,null,{"$f":"IF((B2235=\"\"),\"--\",\"X\")","v":"--"}]
[null,null,"LEI",null,"PROJETO","ATENDEU À LEGISLAÇÃO",null,null,"NÃO ATENDEU À LEGISLAÇÃO",null,null,{"$f":"L2235","v":"--"}]
["Caracterização da Via: ",null,null,null,null,{"$f":"IF(ISBLANK(C2237),\"\",(IF((C2237=E2237),\"X\",\"\")))","v":""},null,null,{"$f":"IF(NOT(C2237=E2237),\"X\",\"\")","v":""},null,null,{"$f":"L2236","v":"--"}]
["Largura da Caixa da Via:",null,null,null,null,{"$f":"IF(ISBLANK(C2238),\"\",(IF((C2238<=E2238),\"X\",\"\")))","v":""},null,null,{"$f":"IF(ISBLANK(C2238),\"\",(IF((C2238>E2238),\"X\",\"\")))","v":""},null,null,"--"]
["Largura da Pista ",null,null,null,null,{"$f":"IF(ISBLANK(C2239),\"\",(IF((C2239<=E2239),\"X\",\"\")))","v":""},null,null,"",null,null,"--"]
["Largura da calçada",null,null,null,null,"",null,null,"",null,null,"--"]
["Largura do passeio",null,null,null,null,"",null,null,"",null,null,"--"]
["Ciclovia",null,null,null,null,"",null,null,"",null,null,"--"]
["Ciclofaixa",null,null,null,null,"",null,null,"",null,null,"--"]
[null,null,null,null,null,null,null,null,null,null,null,"--"]
["R47",{"$f":"IF(ISTEXT(VLOOKUP(A2245,'FICHA DE PROJETO'!$A$399:$I$579,2,FALSE)),VLOOKUP(A2245,'FICHA DE PROJETO'!$A$399:$I$579,2,FALSE),\"\")","v":""},null,null,null,null,null,null,null,null,null,{"$f":"IF((B2245=\"\"),\"--\",\"X\")","v":"--"}]
[null,null,"LEI",null,"PROJETO","ATENDEU À LEGISLAÇÃO",null,null,"NÃO ATENDEU À LEGISLAÇÃO",null,null,{"$f":"L2245","v":"--"}]
["Caracterização da Via: ",null,null,null,null,{"$f":"IF(ISBLANK(C2247),\"\",(IF((C2247=E2247),\"X\",\"\")))","v":""},null,null,{"$f":"IF(NOT(C2247=E2247),\"X\",\"\")","v":""},null,null,{"$f":"L2246","v":"--"}]
["Largura da Caixa da Via:",null,null,null,null,{"$f":"IF(ISBLANK(C2248),\"\",(IF((C2248<=E2248),\"X\",\"\")))","v":""},null,null,{"$f":"IF(ISBLANK(C2248),\"\",(IF((C2248>E2248),\"X\",\"\")))","v":""},null,null,"--"]
["Largura da Pista ",null,null,null,null,{"$f":"IF(ISBLANK(C2249),\"\",(IF((C2249<=E2249),\"X\",\"\")))","v":""},null,null,"",null,null,"--"]
["Largura da calçada",null,null,null,null,"",null,null,"",null,null,"--"]
["Largura do passeio",null,null,null,null,"",null,null,"",null,null,"--"]
["Ciclovia",null,null,null,null,"",null,null,"",null,null,"--"]
["Ciclofaixa",null,null,null,null,"",null,null,"",null,null,"--"]
[null,null,null,null,null,null,null,null,null,null,null,"--"]
["R48",{"$f":"IF(ISTEXT(VLOOKUP(A2255,'FICHA DE PROJETO'!$A$399:$I$579,2,FALSE)),VLOOKUP(A2255,'FICHA DE PROJETO'!$A$399:$I$579,2,FALSE),\"\")","v":""},null,null,null,null,null,null,null,null,null,{"$f":"IF((B2255=\"\"),\"--\",\"X\")","v":"--"}]
[null,null,"LEI",null,"PROJETO","ATENDEU À LEGISLAÇÃO",null,null,"NÃO ATENDEU À LEGISLAÇÃO",null,null,{"$f":"L2255","v":"--"}]
["Caracterização da Via: ",null,null,null,null,{"$f":"IF(ISBLANK(C2257),\"\",(IF((C2257=E2257),\"X\",\"\")))","v":""},null,null,{"$f":"IF(NOT(C2257=E2257),\"X\",\"\")","v":""},null,null,{"$f":"L2256","v":"--"}]
["Largura da Caixa da Via:",null,null,null,null,{"$f":"IF(ISBLANK(C2258),\"\",(IF((C2258<=E2258),\"X\",\"\")))","v":""},null,null,{"$f":"IF(ISBLANK(C2258),\"\",(IF((C2258>E2258),\"X\",\"\")))","v":""},null,null,"--"]
["Largura da Pista ",null,null,null,null,{"$f":"IF(ISBLANK(C2259),\"\",(IF((C2259<=E2259),\"X\",\"\")))","v":""},null,null,"",null,null,"--"]
["Largura da calçada",null,null,null,null,"",null,null,"",null,null,"--"]
["Largura do passeio",null,null,null,null,"",null,null,"",null,null,"--"]
["Ciclovia",null,null,null,null,"",null,null,"",null,null,"--"]
["Ciclofaixa",null,null,null,null,"",null,null,"",null,null,"--"]
[null,null,null,null,null,null,null,null,null,null,null,"--"]
["R49",{"$f":"IF(ISTEXT(VLOOKUP(A2265,'FICHA DE PROJETO'!$A$399:$I$579,2,FALSE)),VLOOKUP(A2265,'FICHA DE PROJETO'!$A$399:$I$579,2,FALSE),\"\")","v":""},null,null,null,null,null,null,null,null,null,{"$f":"IF((B2265=\"\"),\"--\",\"X\")","v":"--"}]
[null,null,"LEI",null,"PROJETO","ATENDEU À LEGISLAÇÃO",null,null,"NÃO ATENDEU À LEGISLAÇÃO",null,null,{"$f":"L2265","v":"--"}]
["Caracterização da Via: ",null,null,null,null,{"$f":"IF(ISBLANK(C2267),\"\",(IF((C2267=E2267),\"X\",\"\")))","v":""},null,null,{"$f":"IF(NOT(C2267=E2267),\"X\",\"\")","v":""},null,null,{"$f":"L2266","v":"--"}]
["Largura da Caixa da Via:",null,null,null,null,{"$f":"IF(ISBLANK(C2268),\"\",(IF((C2268<=E2268),\"X\",\"\")))","v":""},null,null,{"$f":"IF(ISBLANK(C2268),\"\",(IF((C2268>E2268),\"X\",\"\")))","v":""},null,null,"--"]
["Largura da Pista ",null,null,null,null,{"$f":"IF(ISBLANK(C2269),\"\",(IF((C2269<=E2269),\"X\",\"\")))","v":""},null,null,"",null,null,"--"]
["Largura da calçada",null,null,null,null,"",null,null,"",null,null,"--"]
["Largura do passeio",null,null,null,null,"",null,null,"",null,null,"--"]
["Ciclovia",null,null,null,null,"",null,null,"",null,null,"--"]
["Ciclofaixa",null,null,null,null,"",null,null,"",null,null,"--"]
[null,null,null,null,null,null,null,null,null,null,null,"--"]
["R50",{"$f":"IF(ISTEXT(VLOOKUP(A2275,'FICHA DE PROJETO'!$A$399:$I$579,2,FALSE)),VLOOKUP(A2275,'FICHA DE PROJETO'!$A$399:$I$579,2,FALSE),\"\")","v":""},null,null,null,null,null,null,null,null,null,{"$f":"IF((B2275=\"\"),\"--\",\"X\")","v":"--"}]
[null,null,"LEI",null,"PROJETO","ATENDEU À LEGISLAÇÃO",null,null,"NÃO ATENDEU À LEGISLAÇÃO",null,null,{"$f":"L2275","v":"--"}]
["Caracterização da Via: ",null,null,null,null,{"$f":"IF(ISBLANK(C2277),\"\",(IF((C2277=E2277),\"X\",\"\")))","v":""},null,null,{"$f":"IF(NOT(C2277=E2277),\"X\",\"\")","v":""},null,null,{"$f":"L2276","v":"--"}]
["Largura da Caixa da Via:",null,null,null,null,{"$f":"IF(ISBLANK(C2278),\"\",(IF((C2278<=E2278),\"X\",\"\")))","v":""},null,null,{"$f":"IF(ISBLANK(C2278),\"\",(IF((C2278>E2278),\"X\",\"\")))","v":""},null,null,"--"]
["Largura da Pista ",null,null,null,null,{"$f":"IF(ISBLANK(C2279),\"\",(IF((C2279<=E2279),\"X\",\"\")))","v":""},null,null,"",null,null,"--"]
["Largura da calçada",null,null,null,null,"",null,null,"",null,null,"--"]
["Largura do passeio",null,null,null,null,"",null,null,"",null,null,"--"]
["Ciclovia",null,null,null,null,"",null,null,"",null,null,"--"]
["Ciclofaixa",null,null,null,null,"",null,null,"",null,null,"--"]
[null,null,null,null,null,null,null,null,null,null,null,"--"]
["RUAS DO LOTE 04",null,null,null,null,null,null,null,null,null,null,{"$f":"IF('FICHA DE PROJETO'!K580=\"X\",\"X\",\"--\")","v":"--"}]
["R01",{"$f":"IF(ISTEXT(VLOOKUP(A2286,'FICHA DE PROJETO'!$A$582:$I$761,2,FALSE)),VLOOKUP(A2286,'FICHA DE PROJETO'!$A$582:$I$761,2,FALSE),\"\")","v":""},null,null,null,null,null,null,null,null,null,{"$f":"IF((B2286=\"\"),\"--\",\"X\")","v":"--"}]
[null,null,"LEI",null,"PROJETO","ATENDEU À LEGISLAÇÃO",null,null,"NÃO ATENDEU À LEGISLAÇÃO",null,null,{"$f":"L2286","v":"--"}]
["Caracterização da Via: ",null,"Local",null,"Local",{"$f":"IF(ISBLANK(C2288),\"\",(IF((C2288=E2288),\"X\",\"\")))","v":"X"},null,null,{"$f":"IF(NOT(C2288=E2288),\"X\",\"\")","v":""},null,null,{"$f":"L2287","v":"--"}]
["Largura da Caixa da Via:",null,18,null,18,{"$f":"IF(ISBLANK(C2289),\"\",(IF((C2289<=E2289),\"X\",\"\")))","v":"X"},null,null,{"$f":"IF(ISBLANK(C2289),\"\",(IF((C2289>E2289),\"X\",\"\")))","v":""},null,null,"--"]
["Largura da Pista ",null,10,null,9,{"$f":"IF(ISBLANK(C2290),\"\",(IF((C2290<=E2290),\"X\",\"\")))","v":""},null,null,"X",null,null,"--"]
["Largura da calçada",null,4,null,4.5,"X",null,null,"",null,null,"--"]
["Largura do passeio",null,1.5,null,1.2,"",null,null,"X",null,null,"--"]
["Ciclovia",null,null,null,null,"",null,null,"",null,null,"--"]
["Ciclofaixa",null,null,null,null,"",null,null,"",null,null,"--"]
[null,null,null,null,null,null,null,null,null,null,null,"--"]
["R02",{"$f":"IF(ISTEXT(VLOOKUP(A2296,'FICHA DE PROJETO'!$A$582:$I$761,2,FALSE)),VLOOKUP(A2296,'FICHA DE PROJETO'!$A$582:$I$761,2,FALSE),\"\")","v":""},null,null,null,null,null,null,null,null,null,{"$f":"IF((B2296=\"\"),\"--\",\"X\")","v":"--"}]
[null,null,"LEI",null,"PROJETO","ATENDEU À LEGISLAÇÃO",null,null,"NÃO ATENDEU À LEGISLAÇÃO",null,null,{"$f":"L2296","v":"--"}]
["Caracterização da Via: ",null,"Local",null,"Local",{"$f":"IF(ISBLANK(C2298),\"\",(IF((C2298=E2298),\"X\",\"\")))","v":"X"},null,null,{"$f":"IF(NOT(C2298=E2298),\"X\",\"\")","v":""},null,null,{"$f":"L2297","v":"--"}]
["Largura da Caixa da Via:",null,14,null,14,{"$f":"IF(ISBLANK(C2299),\"\",(IF((C2299<=E2299),\"X\",\"\")))","v":"X"},null,null,{"$f":"IF(ISBLANK(C2299),\"\",(IF((C2299>E2299),\"X\",\"\")))","v":""},null,null,"--"]
["Largura da Pista ",null,7,null,6,{"$f":"IF(ISBLANK(C2300),\"\",(IF((C2300<=E2300),\"X\",\"\")))","v":""},null,null,"X",null,null,"--"]
["Largura da calçada",null,3,null,2.5,"",null,null,"X",null,null,"--"]
["Largura do passeio",null,1.5,null,1.2,"",null,null,"X",null,null,"--"]
["Ciclovia",null,null,null,null,"",null,null,"",null,null,"--"]
["Ciclofaixa",null,null,null,null,"",null,null,"",null,null,"--"]
[null,null,null,null,null,null,null,null,null,null,null,"--"]
["R03",{"$f":"IF(ISTEXT(VLOOKUP(A2306,'FICHA DE PROJETO'!$A$582:$I$761,2,FALSE)),VLOOKUP(A2306,'FICHA DE PROJETO'!$A$582:$I$761,2,FALSE),\"\")","v":""},null,null,null,null,null,null,null,null,null,{"$f":"IF((B2306=\"\"),\"--\",\"X\")","v":"--"}]
[null,null,"LEI",null,"PROJETO","ATENDEU À LEGISLAÇÃO",null,null,"NÃO ATENDEU À LEGISLAÇÃO",null,null,{"$f":"L2306","v":"--"}]
["Caracterização da Via: ",null,"Local",null,"Local",{"$f":"IF(ISBLANK(C2308),\"\",(IF((C2308=E2308),\"X\",\"\")))","v":"X"},null,null,{"$f":"IF(NOT(C2308=E2308),\"X\",\"\")","v":""},null,null,{"$f":"L2307","v":"--"}]
["Largura da Caixa da Via:",null,15,null,15,{"$f":"IF(ISBLANK(C2309),\"\",(IF((C2309<=E2309),\"X\",\"\")))","v":"X"},null,null,{"$f":"IF(ISBLANK(C2309),\"\",(IF((C2309>E2309),\"X\",\"\")))","v":""},null,null,"--"]
["Largura da Pista ",null,7,null,6,{"$f":"IF(ISBLANK(C2310),\"\",(IF((C2310<=E2310),\"X\",\"\")))","v":""},null,null,"X",null,null,"--"]
["Largura da calçada",null,3,null,2.5,"",null,null,"X",null,null,"--"]
["Largura do passeio",null,1.5,null,1.2,"",null,null,"X",null,null,"--"]
["Ciclovia",null,null,null,null,"",null,null,"",null,null,"--"]
["Ciclofaixa",null,null,null,null,"",null,null,"",null,null,"--"]
[null,null,null,null,null,null,null,null,null,null,null,"--"]
["R04",{"$f":"IF(ISTEXT(VLOOKUP(A2316,'FICHA DE PROJETO'!$A$582:$I$761,2,FALSE)),VLOOKUP(A2316,'FICHA DE PROJETO'!$A$582:$I$761,2,FALSE),\"\")","v":""},null,null,null,null,null,null,null,null,null,{"$f":"IF((B2316=\"\"),\"--\",\"X\")","v":"--"}]
[null,null,"LEI",null,"PROJETO","ATENDEU À LEGISLAÇÃO",null,null,"NÃO ATENDEU À LEGISLAÇÃO",null,null,{"$f":"L2316","v":"--"}]
["Caracterização da Via: ",null,"Local",null,"Local",{"$f":"IF(ISBLANK(C2318),\"\",(IF((C2318=E2318),\"X\",\"\")))","v":"X"},null,null,{"$f":"IF(NOT(C2318=E2318),\"X\",\"\")","v":""},null,null,{"$f":"L2317","v":"--"}]
["Largura da Caixa da Via:",null,14,null,12,{"$f":"IF(ISBLANK(C2319),\"\",(IF((C2319<=E2319),\"X\",\"\")))","v":""},null,null,{"$f":"IF(ISBLANK(C2319),\"\",(IF((C2319>E2319),\"X\",\"\")))","v":"X"},null,null,"--"]
["Largura da Pista ",null,8,null,7,{"$f":"IF(ISBLANK(C2320),\"\",(IF((C2320<=E2320),\"X\",\"\")))","v":""},null,null,"X",null,null,"--"]
["Largura da calçada",null,3,null,3.5,"X",null,null,"",null,null,"--"]
["Largura do passeio",null,1.5,null,1.2,"",null,null,"X",null,null,"--"]
["Ciclovia",null,null,null,null,"",null,null,"",null,null,"--"]
["Ciclofaixa",null,null,null,null,"",null,null,"",null,null,"--"]
[null,null,null,null,null,null,null,null,null,null,null,"--"]
["R05",{"$f":"IF(ISTEXT(VLOOKUP(A2326,'FICHA DE PROJETO'!$A$582:$I$761,2,FALSE)),VLOOKUP(A2326,'FICHA DE PROJETO'!$A$582:$I$761,2,FALSE),\"\")","v":""},null,null,null,null,null,null,null,null,null,{"$f":"IF((B2326=\"\"),\"--\",\"X\")","v":"--"}]
[null,null,"LEI",null,"PROJETO","ATENDEU À LEGISLAÇÃO",null,null,"NÃO ATENDEU À LEGISLAÇÃO",null,null,{"$f":"L2326","v":"--"}]
["Caracterização da Via: ",null,null,null,null,{"$f":"IF(ISBLANK(C2328),\"\",(IF((C2328=E2328),\"X\",\"\")))","v":""},null,null,{"$f":"IF(NOT(C2328=E2328),\"X\",\"\")","v":""},null,null,{"$f":"L2327","v":"--"}]
["Largura da Caixa da Via:",null,null,null,null,{"$f":"IF(ISBLANK(C2329),\"\",(IF((C2329<=E2329),\"X\",\"\")))","v":""},null,null,{"$f":"IF(ISBLANK(C2329),\"\",(IF((C2329>E2329),\"X\",\"\")))","v":""},null,null,"--"]
["Largura da Pista ",null,null,null,null,{"$f":"IF(ISBLANK(C2330),\"\",(IF((C2330<=E2330),\"X\",\"\")))","v":""},null,null,"",null,null,"--"]
["Largura da calçada",null,null,null,null,"",null,null,"",null,null,"--"]
["Largura do passeio",null,null,null,null,"",null,null,"",null,null,"--"]
["Ciclovia",null,null,null,null,"",null,null,"",null,null,"--"]
["Ciclofaixa",null,null,null,null,"",null,null,"",null,null,"--"]
[null,null,null,null,null,null,null,null,null,null,null,"--"]
["R06",{"$f":"IF(ISTEXT(VLOOKUP(A2336,'FICHA DE PROJETO'!$A$582:$I$761,2,FALSE)),VLOOKUP(A2336,'FICHA DE PROJETO'!$A$582:$I$761,2,FALSE),\"\")","v":""},null,null,null,null,null,null,null,null,null,{"$f":"IF((B2336=\"\"),\"--\",\"X\")","v":"--"}]
[null,null,"LEI",null,"PROJETO","ATENDEU À LEGISLAÇÃO",null,null,"NÃO ATENDEU À LEGISLAÇÃO",null,null,{"$f":"L2336","v":"--"}]
["Caracterização da Via: ",null,null,null,null,{"$f":"IF(ISBLANK(C2338),\"\",(IF((C2338=E2338),\"X\",\"\")))","v":""},null,null,{"$f":"IF(NOT(C2338=E2338),\"X\",\"\")","v":""},null,null,{"$f":"L2337","v":"--"}]
["Largura da Caixa da Via:",null,null,null,null,{"$f":"IF(ISBLANK(C2339),\"\",(IF((C2339<=E2339),\"X\",\"\")))","v":""},null,null,{"$f":"IF(ISBLANK(C2339),\"\",(IF((C2339>E2339),\"X\",\"\")))","v":""},null,null,"--"]
["Largura da Pista ",null,null,null,null,{"$f":"IF(ISBLANK(C2340),\"\",(IF((C2340<=E2340),\"X\",\"\")))","v":""},null,null,"",null,null,"--"]
["Largura da calçada",null,null,null,null,"",null,null,"",null,null,"--"]
["Largura do passeio",null,null,null,null,"",null,null,"",null,null,"--"]
["Ciclovia",null,null,null,null,"",null,null,"",null,null,"--"]
["Ciclofaixa",null,null,null,null,"",null,null,"",null,null,"--"]
[null,null,null,null,null,null,null,null,null,null,null,"--"]
["R07",{"$f":"IF(ISTEXT(VLOOKUP(A2346,'FICHA DE PROJETO'!$A$582:$I$761,2,FALSE)),VLOOKUP(A2346,'FICHA DE PROJETO'!$A$582:$I$761,2,FALSE),\"\")","v":""},null,null,null,null,null,null,null,null,null,{"$f":"IF((B2346=\"\"),\"--\",\"X\")","v":"--"}]
[null,null,"LEI",null,"PROJETO","ATENDEU À LEGISLAÇÃO",null,null,"NÃO ATENDEU À LEGISLAÇÃO",null,null,{"$f":"L2346","v":"--"}]
["Caracterização da Via: ",null,null,null,null,{"$f":"IF(ISBLANK(C2348),\"\",(IF((C2348=E2348),\"X\",\"\")))","v":""},null,null,{"$f":"IF(NOT(C2348=E2348),\"X\",\"\")","v":""},null,null,{"$f":"L2347","v":"--"}]
["Largura da Caixa da Via:",null,null,null,null,{"$f":"IF(ISBLANK(C2349),\"\",(IF((C2349<=E2349),\"X\",\"\")))","v":""},null,null,{"$f":"IF(ISBLANK(C2349),\"\",(IF((C2349>E2349),\"X\",\"\")))","v":""},null,null,"--"]
["Largura da Pista ",null,null,null,null,{"$f":"IF(ISBLANK(C2350),\"\",(IF((C2350<=E2350),\"X\",\"\")))","v":""},null,null,"",null,null,"--"]
["Largura da calçada",null,null,null,null,"",null,null,"",null,null,"--"]
["Largura do passeio",null,null,null,null,"",null,null,"",null,null,"--"]
["Ciclovia",null,null,null,null,"",null,null,"",null,null,"--"]
["Ciclofaixa",null,null,null,null,"",null,null,"",null,null,"--"]
[null,null,null,null,null,null,null,null,null,null,null,"--"]
["R08",{"$f":"IF(ISTEXT(VLOOKUP(A2356,'FICHA DE PROJETO'!$A$582:$I$761,2,FALSE)),VLOOKUP(A2356,'FICHA DE PROJETO'!$A$582:$I$761,2,FALSE),\"\")","v":""},null,null,null,null,null,null,null,null,null,{"$f":"IF((B2356=\"\"),\"--\",\"X\")","v":"--"}]
[null,null,"LEI",null,"PROJETO","ATENDEU À LEGISLAÇÃO",null,null,"NÃO ATENDEU À LEGISLAÇÃO",null,null,{"$f":"L2356","v":"--"}]
["Caracterização da Via: ",null,null,null,null,{"$f":"IF(ISBLANK(C2358),\"\",(IF((C2358=E2358),\"X\",\"\")))","v":""},null,null,{"$f":"IF(NOT(C2358=E2358),\"X\",\"\")","v":""},null,null,{"$f":"L2357","v":"--"}]
["Largura da Caixa da Via:",null,null,null,null,{"$f":"IF(ISBLANK(C2359),\"\",(IF((C2359<=E2359),\"X\",\"\")))","v":""},null,null,{"$f":"IF(ISBLANK(C2359),\"\",(IF((C2359>E2359),\"X\",\"\")))","v":""},null,null,"--"]
["Largura da Pista ",null,null,null,null,{"$f":"IF(ISBLANK(C2360),\"\",(IF((C2360<=E2360),\"X\",\"\")))","v":""},null,null,"",null,null,"--"]
["Largura da calçada",null,null,null,null,"",null,null,"",null,null,"--"]
["Largura do passeio",null,null,null,null,"",null,null,"",null,null,"--"]
["Ciclovia",null,null,null,null,"",null,null,"",null,null,"--"]
["Ciclofaixa",null,null,null,null,"",null,null,"",null,null,"--"]
[null,null,null,null,null,null,null,null,null,null,null,"--"]
["R09",{"$f":"IF(ISTEXT(VLOOKUP(A2366,'FICHA DE PROJETO'!$A$582:$I$761,2,FALSE)),VLOOKUP(A2366,'FICHA DE PROJETO'!$A$582:$I$761,2,FALSE),\"\")","v":""},null,null,null,null,null,null,null,null,null,{"$f":"IF((B2366=\"\"),\"--\",\"X\")","v":"--"}]
[null,null,"LEI",null,"PROJETO","ATENDEU À LEGISLAÇÃO",null,null,"NÃO ATENDEU À LEGISLAÇÃO",null,null,{"$f":"L2366","v":"--"}]
["Caracterização da Via: ",null,null,null,null,{"$f":"IF(ISBLANK(C2368),\"\",(IF((C2368=E2368),\"X\",\"\")))","v":""},null,null,{"$f":"IF(NOT(C2368=E2368),\"X\",\"\")","v":""},null,null,{"$f":"L2367","v":"--"}]
["Largura da Caixa da Via:",null,null,null,null,{"$f":"IF(ISBLANK(C2369),\"\",(IF((C2369<=E2369),\"X\",\"\")))","v":""},null,null,{"$f":"IF(ISBLANK(C2369),\"\",(IF((C2369>E2369),\"X\",\"\")))","v":""},null,null,"--"]
["Largura da Pista ",null,null,null,null,{"$f":"IF(ISBLANK(C2370),\"\",(IF((C2370<=E2370),\"X\",\"\")))","v":""},null,null,"",null,null,"--"]
["Largura da calçada",null,null,null,null,"",null,null,"",null,null,"--"]
["Largura do passeio",null,null,null,null,"",null,null,"",null,null,"--"]
["Ciclovia",null,null,null,null,"",null,null,"",null,null,"--"]
["Ciclofaixa",null,null,null,null,"",null,null,"",null,null,"--"]
[null,null,null,null,null,null,null,null,null,null,null,"--"]
["R10",{"$f":"IF(ISTEXT(VLOOKUP(A2376,'FICHA DE PROJETO'!$A$582:$I$761,2,FALSE)),VLOOKUP(A2376,'FICHA DE PROJETO'!$A$582:$I$761,2,FALSE),\"\")","v":""},null,null,null,null,null,null,null,null,null,{"$f":"IF((B2376=\"\"),\"--\",\"X\")","v":"--"}]
[null,null,"LEI",null,"PROJETO","ATENDEU À LEGISLAÇÃO",null,null,"NÃO ATENDEU À LEGISLAÇÃO",null,null,{"$f":"L2376","v":"--"}]
["Caracterização da Via: ",null,null,null,null,{"$f":"IF(ISBLANK(C2378),\"\",(IF((C2378=E2378),\"X\",\"\")))","v":""},null,null,{"$f":"IF(NOT(C2378=E2378),\"X\",\"\")","v":""},null,null,{"$f":"L2377","v":"--"}]
["Largura da Caixa da Via:",null,null,null,null,{"$f":"IF(ISBLANK(C2379),\"\",(IF((C2379<=E2379),\"X\",\"\")))","v":""},null,null,{"$f":"IF(ISBLANK(C2379),\"\",(IF((C2379>E2379),\"X\",\"\")))","v":""},null,null,"--"]
["Largura da Pista ",null,null,null,null,{"$f":"IF(ISBLANK(C2380),\"\",(IF((C2380<=E2380),\"X\",\"\")))","v":""},null,null,"",null,null,"--"]
["Largura da calçada",null,null,null,null,"",null,null,"",null,null,"--"]
["Largura do passeio",null,null,null,null,"",null,null,"",null,null,"--"]
["Ciclovia",null,null,null,null,"",null,null,"",null,null,"--"]
["Ciclofaixa",null,null,null,null,"",null,null,"",null,null,"--"]
[null,null,null,null,null,null,null,null,null,null,null,"--"]
["R11",{"$f":"IF(ISTEXT(VLOOKUP(A2386,'FICHA DE PROJETO'!$A$582:$I$761,2,FALSE)),VLOOKUP(A2386,'FICHA DE PROJETO'!$A$582:$I$761,2,FALSE),\"\")","v":""},null,null,null,null,null,null,null,null,null,{"$f":"IF((B2386=\"\"),\"--\",\"X\")","v":"--"}]
[null,null,"LEI",null,"PROJETO","ATENDEU À LEGISLAÇÃO",null,null,"NÃO ATENDEU À LEGISLAÇÃO",null,null,{"$f":"L2386","v":"--"}]
["Caracterização da Via: ",null,null,null,null,{"$f":"IF(ISBLANK(C2388),\"\",(IF((C2388=E2388),\"X\",\"\")))","v":""},null,null,{"$f":"IF(NOT(C2388=E2388),\"X\",\"\")","v":""},null,null,{"$f":"L2387","v":"--"}]
["Largura da Caixa da Via:",null,null,null,null,{"$f":"IF(ISBLANK(C2389),\"\",(IF((C2389<=E2389),\"X\",\"\")))","v":""},null,null,{"$f":"IF(ISBLANK(C2389),\"\",(IF((C2389>E2389),\"X\",\"\")))","v":""},null,null,"--"]
["Largura da Pista ",null,null,null,null,{"$f":"IF(ISBLANK(C2390),\"\",(IF((C2390<=E2390),\"X\",\"\")))","v":""},null,null,"",null,null,"--"]
["Largura da calçada",null,null,null,null,"",null,null,"",null,null,"--"]
["Largura do passeio",null,null,null,null,"",null,null,"",null,null,"--"]
["Ciclovia",null,null,null,null,"",null,null,"",null,null,"--"]
["Ciclofaixa",null,null,null,null,"",null,null,"",null,null,"--"]
[null,null,null,null,null,null,null,null,null,null,null,"--"]
["R12",{"$f":"IF(ISTEXT(VLOOKUP(A2396,'FICHA DE PROJETO'!$A$582:$I$761,2,FALSE)),VLOOKUP(A2396,'FICHA DE PROJETO'!$A$582:$I$761,2,FALSE),\"\")","v":""},null,null,null,null,null,null,null,null,null,{"$f":"IF((B2396=\"\"),\"--\",\"X\")","v":"--"}]
[null,null,"LEI",null,"PROJETO","ATENDEU À LEGISLAÇÃO",null,null,"NÃO ATENDEU À LEGISLAÇÃO",null,null,{"$f":"L2396","v":"--"}]
["Caracterização da Via: ",null,null,null,null,{"$f":"IF(ISBLANK(C2398),\"\",(IF((C2398=E2398),\"X\",\"\")))","v":""},null,null,{"$f":"IF(NOT(C2398=E2398),\"X\",\"\")","v":""},null,null,{"$f":"L2397","v":"--"}]
["Largura da Caixa da Via:",null,null,null,null,{"$f":"IF(ISBLANK(C2399),\"\",(IF((C2399<=E2399),\"X\",\"\")))","v":""},null,null,{"$f":"IF(ISBLANK(C2399),\"\",(IF((C2399>E2399),\"X\",\"\")))","v":""},null,null,"--"]
["Largura da Pista ",null,null,null,null,{"$f":"IF(ISBLANK(C2400),\"\",(IF((C2400<=E2400),\"X\",\"\")))","v":""},null,null,"",null,null,"--"]
["Largura da calçada",null,null,null,null,"",null,null,"",null,null,"--"]
["Largura do passeio",null,null,null,null,"",null,null,"",null,null,"--"]
["Ciclovia",null,null,null,null,"",null,null,"",null,null,"--"]
["Ciclofaixa",null,null,null,null,"",null,null,"",null,null,"--"]
[null,null,null,null,null,null,null,null,null,null,null,"--"]
["R13",{"$f":"IF(ISTEXT(VLOOKUP(A2406,'FICHA DE PROJETO'!$A$582:$I$761,2,FALSE)),VLOOKUP(A2406,'FICHA DE PROJETO'!$A$582:$I$761,2,FALSE),\"\")","v":""},null,null,null,null,null,null,null,null,null,{"$f":"IF((B2406=\"\"),\"--\",\"X\")","v":"--"}]
[null,null,"LEI",null,"PROJETO","ATENDEU À LEGISLAÇÃO",null,null,"NÃO ATENDEU À LEGISLAÇÃO",null,null,{"$f":"L2406","v":"--"}]
["Caracterização da Via: ",null,null,null,null,{"$f":"IF(ISBLANK(C2408),\"\",(IF((C2408=E2408),\"X\",\"\")))","v":""},null,null,{"$f":"IF(NOT(C2408=E2408),\"X\",\"\")","v":""},null,null,{"$f":"L2407","v":"--"}]
["Largura da Caixa da Via:",null,null,null,null,{"$f":"IF(ISBLANK(C2409),\"\",(IF((C2409<=E2409),\"X\",\"\")))","v":""},null,null,{"$f":"IF(ISBLANK(C2409),\"\",(IF((C2409>E2409),\"X\",\"\")))","v":""},null,null,"--"]
["Largura da Pista ",null,null,null,null,{"$f":"IF(ISBLANK(C2410),\"\",(IF((C2410<=E2410),\"X\",\"\")))","v":""},null,null,"",null,null,"--"]
["Largura da calçada",null,null,null,null,"",null,null,"",null,null,"--"]
["Largura do passeio",null,null,null,null,"",null,null,"",null,null,"--"]
["Ciclovia",null,null,null,null,"",null,null,"",null,null,"--"]
["Ciclofaixa",null,null,null,null,"",null,null,"",null,null,"--"]
[null,null,null,null,null,null,null,null,null,null,null,"--"]
["R14",{"$f":"IF(ISTEXT(VLOOKUP(A2416,'FICHA DE PROJETO'!$A$582:$I$761,2,FALSE)),VLOOKUP(A2416,'FICHA DE PROJETO'!$A$582:$I$761,2,FALSE),\"\")","v":""},null,null,null,null,null,null,null,null,null,{"$f":"IF((B2416=\"\"),\"--\",\"X\")","v":"--"}]
[null,null,"LEI",null,"PROJETO","ATENDEU À LEGISLAÇÃO",null,null,"NÃO ATENDEU À LEGISLAÇÃO",null,null,{"$f":"L2416","v":"--"}]
["Caracterização da Via: ",null,null,null,null,{"$f":"IF(ISBLANK(C2418),\"\",(IF((C2418=E2418),\"X\",\"\")))","v":""},null,null,{"$f":"IF(NOT(C2418=E2418),\"X\",\"\")","v":""},null,null,{"$f":"L2417","v":"--"}]
["Largura da Caixa da Via:",null,null,null,null,{"$f":"IF(ISBLANK(C2419),\"\",(IF((C2419<=E2419),\"X\",\"\")))","v":""},null,null,{"$f":"IF(ISBLANK(C2419),\"\",(IF((C2419>E2419),\"X\",\"\")))","v":""},null,null,"--"]
["Largura da Pista ",null,null,null,null,{"$f":"IF(ISBLANK(C2420),\"\",(IF((C2420<=E2420),\"X\",\"\")))","v":""},null,null,"",null,null,"--"]
["Largura da calçada",null,null,null,null,"",null,null,"",null,null,"--"]
["Largura do passeio",null,null,null,null,"",null,null,"",null,null,"--"]
["Ciclovia",null,null,null,null,"",null,null,"",null,null,"--"]
["Ciclofaixa",null,null,null,null,"",null,null,"",null,null,"--"]
[null,null,null,null,null,null,null,null,null,null,null,"--"]
["R15",{"$f":"IF(ISTEXT(VLOOKUP(A2426,'FICHA DE PROJETO'!$A$582:$I$761,2,FALSE)),VLOOKUP(A2426,'FICHA DE PROJETO'!$A$582:$I$761,2,FALSE),\"\")","v":""},null,null,null,null,null,null,null,null,null,{"$f":"IF((B2426=\"\"),\"--\",\"X\")","v":"--"}]
[null,null,"LEI",null,"PROJETO","ATENDEU À LEGISLAÇÃO",null,null,"NÃO ATENDEU À LEGISLAÇÃO",null,null,{"$f":"L2426","v":"--"}]
["Caracterização da Via: ",null,null,null,null,{"$f":"IF(ISBLANK(C2428),\"\",(IF((C2428=E2428),\"X\",\"\")))","v":""},null,null,{"$f":"IF(NOT(C2428=E2428),\"X\",\"\")","v":""},null,null,{"$f":"L2427","v":"--"}]
["Largura da Caixa da Via:",null,null,null,null,{"$f":"IF(ISBLANK(C2429),\"\",(IF((C2429<=E2429),\"X\",\"\")))","v":""},null,null,{"$f":"IF(ISBLANK(C2429),\"\",(IF((C2429>E2429),\"X\",\"\")))","v":""},null,null,"--"]
["Largura da Pista ",null,null,null,null,{"$f":"IF(ISBLANK(C2430),\"\",(IF((C2430<=E2430),\"X\",\"\")))","v":""},null,null,"",null,null,"--"]
["Largura da calçada",null,null,null,null,"",null,null,"",null,null,"--"]
["Largura do passeio",null,null,null,null,"",null,null,"",null,null,"--"]
["Ciclovia",null,null,null,null,"",null,null,"",null,null,"--"]
["Ciclofaixa",null,null,null,null,"",null,null,"",null,null,"--"]
[null,null,null,null,null,null,null,null,null,null,null,"--"]
["R16",{"$f":"IF(ISTEXT(VLOOKUP(A2436,'FICHA DE PROJETO'!$A$582:$I$761,2,FALSE)),VLOOKUP(A2436,'FICHA DE PROJETO'!$A$582:$I$761,2,FALSE),\"\")","v":""},null,null,null,null,null,null,null,null,null,{"$f":"IF((B2436=\"\"),\"--\",\"X\")","v":"--"}]
[null,null,"LEI",null,"PROJETO","ATENDEU À LEGISLAÇÃO",null,null,"NÃO ATENDEU À LEGISLAÇÃO",null,null,{"$f":"L2436","v":"--"}]
["Caracterização da Via: ",null,null,null,null,{"$f":"IF(ISBLANK(C2438),\"\",(IF((C2438=E2438),\"X\",\"\")))","v":""},null,null,{"$f":"IF(NOT(C2438=E2438),\"X\",\"\")","v":""},null,null,{"$f":"L2437","v":"--"}]
["Largura da Caixa da Via:",null,null,null,null,{"$f":"IF(ISBLANK(C2439),\"\",(IF((C2439<=E2439),\"X\",\"\")))","v":""},null,null,{"$f":"IF(ISBLANK(C2439),\"\",(IF((C2439>E2439),\"X\",\"\")))","v":""},null,null,"--"]
["Largura da Pista ",null,null,null,null,{"$f":"IF(ISBLANK(C2440),\"\",(IF((C2440<=E2440),\"X\",\"\")))","v":""},null,null,"",null,null,"--"]
["Largura da calçada",null,null,null,null,"",null,null,"",null,null,"--"]
["Largura do passeio",null,null,null,null,"",null,null,"",null,null,"--"]
["Ciclovia",null,null,null,null,"",null,null,"",null,null,"--"]
["Ciclofaixa",null,null,null,null,"",null,null,"",null,null,"--"]
[null,null,null,null,null,null,null,null,null,null,null,"--"]
["R17",{"$f":"IF(ISTEXT(VLOOKUP(A2446,'FICHA DE PROJETO'!$A$582:$I$761,2,FALSE)),VLOOKUP(A2446,'FICHA DE PROJETO'!$A$582:$I$761,2,FALSE),\"\")","v":""},null,null,null,null,null,null,null,null,null,{"$f":"IF((B2446=\"\"),\"--\",\"X\")","v":"--"}]
[null,null,"LEI",null,"PROJETO","ATENDEU À LEGISLAÇÃO",null,null,"NÃO ATENDEU À LEGISLAÇÃO",null,null,{"$f":"L2446","v":"--"}]
["Caracterização da Via: ",null,null,null,null,{"$f":"IF(ISBLANK(C2448),\"\",(IF((C2448=E2448),\"X\",\"\")))","v":""},null,null,{"$f":"IF(NOT(C2448=E2448),\"X\",\"\")","v":""},null,null,{"$f":"L2447","v":"--"}]
["Largura da Caixa da Via:",null,null,null,null,{"$f":"IF(ISBLANK(C2449),\"\",(IF((C2449<=E2449),\"X\",\"\")))","v":""},null,null,{"$f":"IF(ISBLANK(C2449),\"\",(IF((C2449>E2449),\"X\",\"\")))","v":""},null,null,"--"]
["Largura da Pista ",null,null,null,null,{"$f":"IF(ISBLANK(C2450),\"\",(IF((C2450<=E2450),\"X\",\"\")))","v":""},null,null,"",null,null,"--"]
["Largura da calçada",null,null,null,null,"",null,null,"",null,null,"--"]
["Largura do passeio",null,null,null,null,"",null,null,"",null,null,"--"]
["Ciclovia",null,null,null,null,"",null,null,"",null,null,"--"]
["Ciclofaixa",null,null,null,null,"",null,null,"",null,null,"--"]
[null,null,null,null,null,null,null,null,null,null,null,"--"]
["R18",{"$f":"IF(ISTEXT(VLOOKUP(A2456,'FICHA DE PROJETO'!$A$582:$I$761,2,FALSE)),VLOOKUP(A2456,'FICHA DE PROJETO'!$A$582:$I$761,2,FALSE),\"\")","v":""},null,null,null,null,null,null,null,null,null,{"$f":"IF((B2456=\"\"),\"--\",\"X\")","v":"--"}]
[null,null,"LEI",null,"PROJETO","ATENDEU À LEGISLAÇÃO",null,null,"NÃO ATENDEU À LEGISLAÇÃO",null,null,{"$f":"L2456","v":"--"}]
["Caracterização da Via: ",null,null,null,null,{"$f":"IF(ISBLANK(C2458),\"\",(IF((C2458=E2458),\"X\",\"\")))","v":""},null,null,{"$f":"IF(NOT(C2458=E2458),\"X\",\"\")","v":""},null,null,{"$f":"L2457","v":"--"}]
["Largura da Caixa da Via:",null,null,null,null,{"$f":"IF(ISBLANK(C2459),\"\",(IF((C2459<=E2459),\"X\",\"\")))","v":""},null,null,{"$f":"IF(ISBLANK(C2459),\"\",(IF((C2459>E2459),\"X\",\"\")))","v":""},null,null,"--"]
["Largura da Pista ",null,null,null,null,{"$f":"IF(ISBLANK(C2460),\"\",(IF((C2460<=E2460),\"X\",\"\")))","v":""},null,null,"",null,null,"--"]
["Largura da calçada",null,null,null,null,"",null,null,"",null,null,"--"]
["Largura do passeio",null,null,null,null,"",null,null,"",null,null,"--"]
["Ciclovia",null,null,null,null,"",null,null,"",null,null,"--"]
["Ciclofaixa",null,null,null,null,"",null,null,"",null,null,"--"]
[null,null,null,null,null,null,null,null,null,null,null,"--"]
["R19",{"$f":"IF(ISTEXT(VLOOKUP(A2466,'FICHA DE PROJETO'!$A$582:$I$761,2,FALSE)),VLOOKUP(A2466,'FICHA DE PROJETO'!$A$582:$I$761,2,FALSE),\"\")","v":""},null,null,null,null,null,null,null,null,null,{"$f":"IF((B2466=\"\"),\"--\",\"X\")","v":"--"}]
[null,null,"LEI",null,"PROJETO","ATENDEU À LEGISLAÇÃO",null,null,"NÃO ATENDEU À LEGISLAÇÃO",null,null,{"$f":"L2466","v":"--"}]
["Caracterização da Via: ",null,null,null,null,{"$f":"IF(ISBLANK(C2468),\"\",(IF((C2468=E2468),\"X\",\"\")))","v":""},null,null,{"$f":"IF(NOT(C2468=E2468),\"X\",\"\")","v":""},null,null,{"$f":"L2467","v":"--"}]
["Largura da Caixa da Via:",null,null,null,null,{"$f":"IF(ISBLANK(C2469),\"\",(IF((C2469<=E2469),\"X\",\"\")))","v":""},null,null,{"$f":"IF(ISBLANK(C2469),\"\",(IF((C2469>E2469),\"X\",\"\")))","v":""},null,null,"--"]
["Largura da Pista ",null,null,null,null,{"$f":"IF(ISBLANK(C2470),\"\",(IF((C2470<=E2470),\"X\",\"\")))","v":""},null,null,"",null,null,"--"]
["Largura da calçada",null,null,null,null,"",null,null,"",null,null,"--"]
["Largura do passeio",null,null,null,null,"",null,null,"",null,null,"--"]
["Ciclovia",null,null,null,null,"",null,null,"",null,null,"--"]
["Ciclofaixa",null,null,null,null,"",null,null,"",null,null,"--"]
[null,null,null,null,null,null,null,null,null,null,null,"--"]
["R20",{"$f":"IF(ISTEXT(VLOOKUP(A2476,'FICHA DE PROJETO'!$A$582:$I$761,2,FALSE)),VLOOKUP(A2476,'FICHA DE PROJETO'!$A$582:$I$761,2,FALSE),\"\")","v":""},null,null,null,null,null,null,null,null,null,{"$f":"IF((B2476=\"\"),\"--\",\"X\")","v":"--"}]
[null,null,"LEI",null,"PROJETO","ATENDEU À LEGISLAÇÃO",null,null,"NÃO ATENDEU À LEGISLAÇÃO",null,null,{"$f":"L2476","v":"--"}]
["Caracterização da Via: ",null,null,null,null,{"$f":"IF(ISBLANK(C2478),\"\",(IF((C2478=E2478),\"X\",\"\")))","v":""},null,null,{"$f":"IF(NOT(C2478=E2478),\"X\",\"\")","v":""},null,null,{"$f":"L2477","v":"--"}]
["Largura da Caixa da Via:",null,null,null,null,{"$f":"IF(ISBLANK(C2479),\"\",(IF((C2479<=E2479),\"X\",\"\")))","v":""},null,null,{"$f":"IF(ISBLANK(C2479),\"\",(IF((C2479>E2479),\"X\",\"\")))","v":""},null,null,"--"]
["Largura da Pista ",null,null,null,null,{"$f":"IF(ISBLANK(C2480),\"\",(IF((C2480<=E2480),\"X\",\"\")))","v":""},null,null,"",null,null,"--"]
["Largura da calçada",null,null,null,null,"",null,null,"",null,null,"--"]
["Largura do passeio",null,null,null,null,"",null,null,"",null,null,"--"]
["Ciclovia",null,null,null,null,"",null,null,"",null,null,"--"]
["Ciclofaixa",null,null,null,null,"",null,null,"",null,null,"--"]
[null,null,null,null,null,null,null,null,null,null,null,"--"]
["R21",{"$f":"IF(ISTEXT(VLOOKUP(A2486,'FICHA DE PROJETO'!$A$582:$I$761,2,FALSE)),VLOOKUP(A2486,'FICHA DE PROJETO'!$A$582:$I$761,2,FALSE),\"\")","v":""},null,null,null,null,null,null,null,null,null,{"$f":"IF((B2486=\"\"),\"--\",\"X\")","v":"--"}]
[null,null,"LEI",null,"PROJETO","ATENDEU À LEGISLAÇÃO",null,null,"NÃO ATENDEU À LEGISLAÇÃO",null,null,{"$f":"L2486","v":"--"}]
["Caracterização da Via: ",null,null,null,null,{"$f":"IF(ISBLANK(C2488),\"\",(IF((C2488=E2488),\"X\",\"\")))","v":""},null,null,{"$f":"IF(NOT(C2488=E2488),\"X\",\"\")","v":""},null,null,{"$f":"L2487","v":"--"}]
["Largura da Caixa da Via:",null,null,null,null,{"$f":"IF(ISBLANK(C2489),\"\",(IF((C2489<=E2489),\"X\",\"\")))","v":""},null,null,{"$f":"IF(ISBLANK(C2489),\"\",(IF((C2489>E2489),\"X\",\"\")))","v":""},null,null,"--"]
["Largura da Pista ",null,null,null,null,{"$f":"IF(ISBLANK(C2490),\"\",(IF((C2490<=E2490),\"X\",\"\")))","v":""},null,null,"",null,null,"--"]
["Largura da calçada",null,null,null,null,"",null,null,"",null,null,"--"]
["Largura do passeio",null,null,null,null,"",null,null,"",null,null,"--"]
["Ciclovia",null,null,null,null,"",null,null,"",null,null,"--"]
["Ciclofaixa",null,null,null,null,"",null,null,"",null,null,"--"]
[null,null,null,null,null,null,null,null,null,null,null,"--"]
["R22",{"$f":"IF(ISTEXT(VLOOKUP(A2496,'FICHA DE PROJETO'!$A$582:$I$761,2,FALSE)),VLOOKUP(A2496,'FICHA DE PROJETO'!$A$582:$I$761,2,FALSE),\"\")","v":""},null,null,null,null,null,null,null,null,null,{"$f":"IF((B2496=\"\"),\"--\",\"X\")","v":"--"}]
[null,null,"LEI",null,"PROJETO","ATENDEU À LEGISLAÇÃO",null,null,"NÃO ATENDEU À LEGISLAÇÃO",null,null,{"$f":"L2496","v":"--"}]
["Caracterização da Via: ",null,null,null,null,{"$f":"IF(ISBLANK(C2498),\"\",(IF((C2498=E2498),\"X\",\"\")))","v":""},null,null,{"$f":"IF(NOT(C2498=E2498),\"X\",\"\")","v":""},null,null,{"$f":"L2497","v":"--"}]
["Largura da Caixa da Via:",null,null,null,null,{"$f":"IF(ISBLANK(C2499),\"\",(IF((C2499<=E2499),\"X\",\"\")))","v":""},null,null,{"$f":"IF(ISBLANK(C2499),\"\",(IF((C2499>E2499),\"X\",\"\")))","v":""},null,null,"--"]
["Largura da Pista ",null,null,null,null,{"$f":"IF(ISBLANK(C2500),\"\",(IF((C2500<=E2500),\"X\",\"\")))","v":""},null,null,"",null,null,"--"]
["Largura da calçada",null,null,null,null,"",null,null,"",null,null,"--"]
["Largura do passeio",null,null,null,null,"",null,null,"",null,null,"--"]
["Ciclovia",null,null,null,null,"",null,null,"",null,null,"--"]
["Ciclofaixa",null,null,null,null,"",null,null,"",null,null,"--"]
[null,null,null,null,null,null,null,null,null,null,null,"--"]
["R23",{"$f":"IF(ISTEXT(VLOOKUP(A2506,'FICHA DE PROJETO'!$A$582:$I$761,2,FALSE)),VLOOKUP(A2506,'FICHA DE PROJETO'!$A$582:$I$761,2,FALSE),\"\")","v":""},null,null,null,null,null,null,null,null,null,{"$f":"IF((B2506=\"\"),\"--\",\"X\")","v":"--"}]
[null,null,"LEI",null,"PROJETO","ATENDEU À LEGISLAÇÃO",null,null,"NÃO ATENDEU À LEGISLAÇÃO",null,null,{"$f":"L2506","v":"--"}]
["Caracterização da Via: ",null,null,null,null,{"$f":"IF(ISBLANK(C2508),\"\",(IF((C2508=E2508),\"X\",\"\")))","v":""},null,null,{"$f":"IF(NOT(C2508=E2508),\"X\",\"\")","v":""},null,null,{"$f":"L2507","v":"--"}]
["Largura da Caixa da Via:",null,null,null,null,{"$f":"IF(ISBLANK(C2509),\"\",(IF((C2509<=E2509),\"X\",\"\")))","v":""},null,null,{"$f":"IF(ISBLANK(C2509),\"\",(IF((C2509>E2509),\"X\",\"\")))","v":""},null,null,"--"]
["Largura da Pista ",null,null,null,null,{"$f":"IF(ISBLANK(C2510),\"\",(IF((C2510<=E2510),\"X\",\"\")))","v":""},null,null,"",null,null,"--"]
["Largura da calçada",null,null,null,null,"",null,null,"",null,null,"--"]
["Largura do passeio",null,null,null,null,"",null,null,"",null,null,"--"]
["Ciclovia",null,null,null,null,"",null,null,"",null,null,"--"]
["Ciclofaixa",null,null,null,null,"",null,null,"",null,null,"--"]
[null,null,null,null,null,null,null,null,null,null,null,"--"]
["R24",{"$f":"IF(ISTEXT(VLOOKUP(A2516,'FICHA DE PROJETO'!$A$582:$I$761,2,FALSE)),VLOOKUP(A2516,'FICHA DE PROJETO'!$A$582:$I$761,2,FALSE),\"\")","v":""},null,null,null,null,null,null,null,null,null,{"$f":"IF((B2516=\"\"),\"--\",\"X\")","v":"--"}]
[null,null,"LEI",null,"PROJETO","ATENDEU À LEGISLAÇÃO",null,null,"NÃO ATENDEU À LEGISLAÇÃO",null,null,{"$f":"L2516","v":"--"}]
["Caracterização da Via: ",null,null,null,null,{"$f":"IF(ISBLANK(C2518),\"\",(IF((C2518=E2518),\"X\",\"\")))","v":""},null,null,{"$f":"IF(NOT(C2518=E2518),\"X\",\"\")","v":""},null,null,{"$f":"L2517","v":"--"}]
["Largura da Caixa da Via:",null,null,null,null,{"$f":"IF(ISBLANK(C2519),\"\",(IF((C2519<=E2519),\"X\",\"\")))","v":""},null,null,{"$f":"IF(ISBLANK(C2519),\"\",(IF((C2519>E2519),\"X\",\"\")))","v":""},null,null,"--"]
["Largura da Pista ",null,null,null,null,{"$f":"IF(ISBLANK(C2520),\"\",(IF((C2520<=E2520),\"X\",\"\")))","v":""},null,null,"",null,null,"--"]
["Largura da calçada",null,null,null,null,"",null,null,"",null,null,"--"]
["Largura do passeio",null,null,null,null,"",null,null,"",null,null,"--"]
["Ciclovia",null,null,null,null,"",null,null,"",null,null,"--"]
["Ciclofaixa",null,null,null,null,"",null,null,"",null,null,"--"]
[null,null,null,null,null,null,null,null,null,null,null,"--"]
["R25",{"$f":"IF(ISTEXT(VLOOKUP(A2526,'FICHA DE PROJETO'!$A$582:$I$761,2,FALSE)),VLOOKUP(A2526,'FICHA DE PROJETO'!$A$582:$I$761,2,FALSE),\"\")","v":""},null,null,null,null,null,null,null,null,null,{"$f":"IF((B2526=\"\"),\"--\",\"X\")","v":"--"}]
[null,null,"LEI",null,"PROJETO","ATENDEU À LEGISLAÇÃO",null,null,"NÃO ATENDEU À LEGISLAÇÃO",null,null,{"$f":"L2526","v":"--"}]
["Caracterização da Via: ",null,null,null,null,{"$f":"IF(ISBLANK(C2528),\"\",(IF((C2528=E2528),\"X\",\"\")))","v":""},null,null,{"$f":"IF(NOT(C2528=E2528),\"X\",\"\")","v":""},null,null,{"$f":"L2527","v":"--"}]
["Largura da Caixa da Via:",null,null,null,null,{"$f":"IF(ISBLANK(C2529),\"\",(IF((C2529<=E2529),\"X\",\"\")))","v":""},null,null,{"$f":"IF(ISBLANK(C2529),\"\",(IF((C2529>E2529),\"X\",\"\")))","v":""},null,null,"--"]
["Largura da Pista ",null,null,null,null,{"$f":"IF(ISBLANK(C2530),\"\",(IF((C2530<=E2530),\"X\",\"\")))","v":""},null,null,"",null,null,"--"]
["Largura da calçada",null,null,null,null,"",null,null,"",null,null,"--"]
["Largura do passeio",null,null,null,null,"",null,null,"",null,null,"--"]
["Ciclovia",null,null,null,null,"",null,null,"",null,null,"--"]
["Ciclofaixa",null,null,null,null,"",null,null,"",null,null,"--"]
[null,null,null,null,null,null,null,null,null,null,null,"--"]
["R26",{"$f":"IF(ISTEXT(VLOOKUP(A2536,'FICHA DE PROJETO'!$A$582:$I$761,2,FALSE)),VLOOKUP(A2536,'FICHA DE PROJETO'!$A$582:$I$761,2,FALSE),\"\")","v":""},null,null,null,null,null,null,null,null,null,{"$f":"IF((B2536=\"\"),\"--\",\"X\")","v":"--"}]
[null,null,"LEI",null,"PROJETO","ATENDEU À LEGISLAÇÃO",null,null,"NÃO ATENDEU À LEGISLAÇÃO",null,null,{"$f":"L2536","v":"--"}]
["Caracterização da Via: ",null,null,null,null,{"$f":"IF(ISBLANK(C2538),\"\",(IF((C2538=E2538),\"X\",\"\")))","v":""},null,null,{"$f":"IF(NOT(C2538=E2538),\"X\",\"\")","v":""},null,null,{"$f":"L2537","v":"--"}]
["Largura da Caixa da Via:",null,null,null,null,{"$f":"IF(ISBLANK(C2539),\"\",(IF((C2539<=E2539),\"X\",\"\")))","v":""},null,null,{"$f":"IF(ISBLANK(C2539),\"\",(IF((C2539>E2539),\"X\",\"\")))","v":""},null,null,"--"]
["Largura da Pista ",null,null,null,null,{"$f":"IF(ISBLANK(C2540),\"\",(IF((C2540<=E2540),\"X\",\"\")))","v":""},null,null,"",null,null,"--"]
["Largura da calçada",null,null,null,null,"",null,null,"",null,null,"--"]
["Largura do passeio",null,null,null,null,"",null,null,"",null,null,"--"]
["Ciclovia",null,null,null,null,"",null,null,"",null,null,"--"]
["Ciclofaixa",null,null,null,null,"",null,null,"",null,null,"--"]
[null,null,null,null,null,null,null,null,null,null,null,"--"]
["R27",{"$f":"IF(ISTEXT(VLOOKUP(A2546,'FICHA DE PROJETO'!$A$582:$I$761,2,FALSE)),VLOOKUP(A2546,'FICHA DE PROJETO'!$A$582:$I$761,2,FALSE),\"\")","v":""},null,null,null,null,null,null,null,null,null,{"$f":"IF((B2546=\"\"),\"--\",\"X\")","v":"--"}]
[null,null,"LEI",null,"PROJETO","ATENDEU À LEGISLAÇÃO",null,null,"NÃO ATENDEU À LEGISLAÇÃO",null,null,{"$f":"L2546","v":"--"}]
["Caracterização da Via: ",null,null,null,null,{"$f":"IF(ISBLANK(C2548),\"\",(IF((C2548=E2548),\"X\",\"\")))","v":""},null,null,{"$f":"IF(NOT(C2548=E2548),\"X\",\"\")","v":""},null,null,{"$f":"L2547","v":"--"}]
["Largura da Caixa da Via:",null,null,null,null,{"$f":"IF(ISBLANK(C2549),\"\",(IF((C2549<=E2549),\"X\",\"\")))","v":""},null,null,{"$f":"IF(ISBLANK(C2549),\"\",(IF((C2549>E2549),\"X\",\"\")))","v":""},null,null,"--"]
["Largura da Pista ",null,null,null,null,{"$f":"IF(ISBLANK(C2550),\"\",(IF((C2550<=E2550),\"X\",\"\")))","v":""},null,null,"",null,null,"--"]
["Largura da calçada",null,null,null,null,"",null,null,"",null,null,"--"]
["Largura do passeio",null,null,null,null,"",null,null,"",null,null,"--"]
["Ciclovia",null,null,null,null,"",null,null,"",null,null,"--"]
["Ciclofaixa",null,null,null,null,"",null,null,"",null,null,"--"]
[null,null,null,null,null,null,null,null,null,null,null,"--"]
["R28",{"$f":"IF(ISTEXT(VLOOKUP(A2556,'FICHA DE PROJETO'!$A$582:$I$761,2,FALSE)),VLOOKUP(A2556,'FICHA DE PROJETO'!$A$582:$I$761,2,FALSE),\"\")","v":""},null,null,null,null,null,null,null,null,null,{"$f":"IF((B2556=\"\"),\"--\",\"X\")","v":"--"}]
[null,null,"LEI",null,"PROJETO","ATENDEU À LEGISLAÇÃO",null,null,"NÃO ATENDEU À LEGISLAÇÃO",null,null,{"$f":"L2556","v":"--"}]
["Caracterização da Via: ",null,null,null,null,{"$f":"IF(ISBLANK(C2558),\"\",(IF((C2558=E2558),\"X\",\"\")))","v":""},null,null,{"$f":"IF(NOT(C2558=E2558),\"X\",\"\")","v":""},null,null,{"$f":"L2557","v":"--"}]
["Largura da Caixa da Via:",null,null,null,null,{"$f":"IF(ISBLANK(C2559),\"\",(IF((C2559<=E2559),\"X\",\"\")))","v":""},null,null,{"$f":"IF(ISBLANK(C2559),\"\",(IF((C2559>E2559),\"X\",\"\")))","v":""},null,null,"--"]
["Largura da Pista ",null,null,null,null,{"$f":"IF(ISBLANK(C2560),\"\",(IF((C2560<=E2560),\"X\",\"\")))","v":""},null,null,"",null,null,"--"]
["Largura da calçada",null,null,null,null,"",null,null,"",null,null,"--"]
["Largura do passeio",null,null,null,null,"",null,null,"",null,null,"--"]
["Ciclovia",null,null,null,null,"",null,null,"",null,null,"--"]
["Ciclofaixa",null,null,null,null,"",null,null,"",null,null,"--"]
[null,null,null,null,null,null,null,null,null,null,null,"--"]
["R29",{"$f":"IF(ISTEXT(VLOOKUP(A2566,'FICHA DE PROJETO'!$A$582:$I$761,2,FALSE)),VLOOKUP(A2566,'FICHA DE PROJETO'!$A$582:$I$761,2,FALSE),\"\")","v":""},null,null,null,null,null,null,null,null,null,{"$f":"IF((B2566=\"\"),\"--\",\"X\")","v":"--"}]
[null,null,"LEI",null,"PROJETO","ATENDEU À LEGISLAÇÃO",null,null,"NÃO ATENDEU À LEGISLAÇÃO",null,null,{"$f":"L2566","v":"--"}]
["Caracterização da Via: ",null,null,null,null,{"$f":"IF(ISBLANK(C2568),\"\",(IF((C2568=E2568),\"X\",\"\")))","v":""},null,null,{"$f":"IF(NOT(C2568=E2568),\"X\",\"\")","v":""},null,null,{"$f":"L2567","v":"--"}]
["Largura da Caixa da Via:",null,null,null,null,{"$f":"IF(ISBLANK(C2569),\"\",(IF((C2569<=E2569),\"X\",\"\")))","v":""},null,null,{"$f":"IF(ISBLANK(C2569),\"\",(IF((C2569>E2569),\"X\",\"\")))","v":""},null,null,"--"]
["Largura da Pista ",null,null,null,null,{"$f":"IF(ISBLANK(C2570),\"\",(IF((C2570<=E2570),\"X\",\"\")))","v":""},null,null,"",null,null,"--"]
["Largura da calçada",null,null,null,null,"",null,null,"",null,null,"--"]
["Largura do passeio",null,null,null,null,"",null,null,"",null,null,"--"]
["Ciclovia",null,null,null,null,"",null,null,"",null,null,"--"]
["Ciclofaixa",null,null,null,null,"",null,null,"",null,null,"--"]
[null,null,null,null,null,null,null,null,null,null,null,"--"]
["R30",{"$f":"IF(ISTEXT(VLOOKUP(A2576,'FICHA DE PROJETO'!$A$582:$I$761,2,FALSE)),VLOOKUP(A2576,'FICHA DE PROJETO'!$A$582:$I$761,2,FALSE),\"\")","v":""},null,null,null,null,null,null,null,null,null,{"$f":"IF((B2576=\"\"),\"--\",\"X\")","v":"--"}]
[null,null,"LEI",null,"PROJETO","ATENDEU À LEGISLAÇÃO",null,null,"NÃO ATENDEU À LEGISLAÇÃO",null,null,{"$f":"L2576","v":"--"}]
["Caracterização da Via: ",null,null,null,null,{"$f":"IF(ISBLANK(C2578),\"\",(IF((C2578=E2578),\"X\",\"\")))","v":""},null,null,{"$f":"IF(NOT(C2578=E2578),\"X\",\"\")","v":""},null,null,{"$f":"L2577","v":"--"}]
["Largura da Caixa da Via:",null,null,null,null,{"$f":"IF(ISBLANK(C2579),\"\",(IF((C2579<=E2579),\"X\",\"\")))","v":""},null,null,{"$f":"IF(ISBLANK(C2579),\"\",(IF((C2579>E2579),\"X\",\"\")))","v":""},null,null,"--"]
["Largura da Pista ",null,null,null,null,{"$f":"IF(ISBLANK(C2580),\"\",(IF((C2580<=E2580),\"X\",\"\")))","v":""},null,null,"",null,null,"--"]
["Largura da calçada",null,null,null,null,"",null,null,"",null,null,"--"]
["Largura do passeio",null,null,null,null,"",null,null,"",null,null,"--"]
["Ciclovia",null,null,null,null,"",null,null,"",null,null,"--"]
["Ciclofaixa",null,null,null,null,"",null,null,"",null,null,"--"]
[null,null,null,null,null,null,null,null,null,null,null,"--"]
["R31",{"$f":"IF(ISTEXT(VLOOKUP(A2586,'FICHA DE PROJETO'!$A$582:$I$761,2,FALSE)),VLOOKUP(A2586,'FICHA DE PROJETO'!$A$582:$I$761,2,FALSE),\"\")","v":""},null,null,null,null,null,null,null,null,null,{"$f":"IF((B2586=\"\"),\"--\",\"X\")","v":"--"}]
[null,null,"LEI",null,"PROJETO","ATENDEU À LEGISLAÇÃO",null,null,"NÃO ATENDEU À LEGISLAÇÃO",null,null,{"$f":"L2586","v":"--"}]
["Caracterização da Via: ",null,null,null,null,{"$f":"IF(ISBLANK(C2588),\"\",(IF((C2588=E2588),\"X\",\"\")))","v":""},null,null,{"$f":"IF(NOT(C2588=E2588),\"X\",\"\")","v":""},null,null,{"$f":"L2587","v":"--"}]
["Largura da Caixa da Via:",null,null,null,null,{"$f":"IF(ISBLANK(C2589),\"\",(IF((C2589<=E2589),\"X\",\"\")))","v":""},null,null,{"$f":"IF(ISBLANK(C2589),\"\",(IF((C2589>E2589),\"X\",\"\")))","v":""},null,null,"--"]
["Largura da Pista ",null,null,null,null,{"$f":"IF(ISBLANK(C2590),\"\",(IF((C2590<=E2590),\"X\",\"\")))","v":""},null,null,"",null,null,"--"]
["Largura da calçada",null,null,null,null,"",null,null,"",null,null,"--"]
["Largura do passeio",null,null,null,null,"",null,null,"",null,null,"--"]
["Ciclovia",null,null,null,null,"",null,null,"",null,null,"--"]
["Ciclofaixa",null,null,null,null,"",null,null,"",null,null,"--"]
[null,null,null,null,null,null,null,null,null,null,null,"--"]
["R32",{"$f":"IF(ISTEXT(VLOOKUP(A2596,'FICHA DE PROJETO'!$A$582:$I$761,2,FALSE)),VLOOKUP(A2596,'FICHA DE PROJETO'!$A$582:$I$761,2,FALSE),\"\")","v":""},null,null,null,null,null,null,null,null,null,{"$f":"IF((B2596=\"\"),\"--\",\"X\")","v":"--"}]
[null,null,"LEI",null,"PROJETO","ATENDEU À LEGISLAÇÃO",null,null,"NÃO ATENDEU À LEGISLAÇÃO",null,null,{"$f":"L2596","v":"--"}]
["Caracterização da Via: ",null,null,null,null,{"$f":"IF(ISBLANK(C2598),\"\",(IF((C2598=E2598),\"X\",\"\")))","v":""},null,null,{"$f":"IF(NOT(C2598=E2598),\"X\",\"\")","v":""},null,null,{"$f":"L2597","v":"--"}]
["Largura da Caixa da Via:",null,null,null,null,{"$f":"IF(ISBLANK(C2599),\"\",(IF((C2599<=E2599),\"X\",\"\")))","v":""},null,null,{"$f":"IF(ISBLANK(C2599),\"\",(IF((C2599>E2599),\"X\",\"\")))","v":""},null,null,"--"]
["Largura da Pista ",null,null,null,null,{"$f":"IF(ISBLANK(C2600),\"\",(IF((C2600<=E2600),\"X\",\"\")))","v":""},null,null,"",null,null,"--"]
["Largura da calçada",null,null,null,null,"",null,null,"",null,null,"--"]
["Largura do passeio",null,null,null,null,"",null,null,"",null,null,"--"]
["Ciclovia",null,null,null,null,"",null,null,"",null,null,"--"]
["Ciclofaixa",null,null,null,null,"",null,null,"",null,null,"--"]
[null,null,null,null,null,null,null,null,null,null,null,"--"]
["R33",{"$f":"IF(ISTEXT(VLOOKUP(A2606,'FICHA DE PROJETO'!$A$582:$I$761,2,FALSE)),VLOOKUP(A2606,'FICHA DE PROJETO'!$A$582:$I$761,2,FALSE),\"\")","v":""},null,null,null,null,null,null,null,null,null,{"$f":"IF((B2606=\"\"),\"--\",\"X\")","v":"--"}]
[null,null,"LEI",null,"PROJETO","ATENDEU À LEGISLAÇÃO",null,null,"NÃO ATENDEU À LEGISLAÇÃO",null,null,{"$f":"L2606","v":"--"}]
["Caracterização da Via: ",null,null,null,null,{"$f":"IF(ISBLANK(C2608),\"\",(IF((C2608=E2608),\"X\",\"\")))","v":""},null,null,{"$f":"IF(NOT(C2608=E2608),\"X\",\"\")","v":""},null,null,{"$f":"L2607","v":"--"}]
["Largura da Caixa da Via:",null,null,null,null,{"$f":"IF(ISBLANK(C2609),\"\",(IF((C2609<=E2609),\"X\",\"\")))","v":""},null,null,{"$f":"IF(ISBLANK(C2609),\"\",(IF((C2609>E2609),\"X\",\"\")))","v":""},null,null,"--"]
["Largura da Pista ",null,null,null,null,{"$f":"IF(ISBLANK(C2610),\"\",(IF((C2610<=E2610),\"X\",\"\")))","v":""},null,null,"",null,null,"--"]
["Largura da calçada",null,null,null,null,"",null,null,"",null,null,"--"]
["Largura do passeio",null,null,null,null,"",null,null,"",null,null,"--"]
["Ciclovia",null,null,null,null,"",null,null,"",null,null,"--"]
["Ciclofaixa",null,null,null,null,"",null,null,"",null,null,"--"]
[null,null,null,null,null,null,null,null,null,null,null,"--"]
["R34",{"$f":"IF(ISTEXT(VLOOKUP(A2616,'FICHA DE PROJETO'!$A$582:$I$761,2,FALSE)),VLOOKUP(A2616,'FICHA DE PROJETO'!$A$582:$I$761,2,FALSE),\"\")","v":""},null,null,null,null,null,null,null,null,null,{"$f":"IF((B2616=\"\"),\"--\",\"X\")","v":"--"}]
[null,null,"LEI",null,"PROJETO","ATENDEU À LEGISLAÇÃO",null,null,"NÃO ATENDEU À LEGISLAÇÃO",null,null,{"$f":"L2616","v":"--"}]
["Caracterização da Via: ",null,null,null,null,{"$f":"IF(ISBLANK(C2618),\"\",(IF((C2618=E2618),\"X\",\"\")))","v":""},null,null,{"$f":"IF(NOT(C2618=E2618),\"X\",\"\")","v":""},null,null,{"$f":"L2617","v":"--"}]
["Largura da Caixa da Via:",null,null,null,null,{"$f":"IF(ISBLANK(C2619),\"\",(IF((C2619<=E2619),\"X\",\"\")))","v":""},null,null,{"$f":"IF(ISBLANK(C2619),\"\",(IF((C2619>E2619),\"X\",\"\")))","v":""},null,null,"--"]
["Largura da Pista ",null,null,null,null,{"$f":"IF(ISBLANK(C2620),\"\",(IF((C2620<=E2620),\"X\",\"\")))","v":""},null,null,"",null,null,"--"]
["Largura da calçada",null,null,null,null,"",null,null,"",null,null,"--"]
["Largura do passeio",null,null,null,null,"",null,null,"",null,null,"--"]
["Ciclovia",null,null,null,null,"",null,null,"",null,null,"--"]
["Ciclofaixa",null,null,null,null,"",null,null,"",null,null,"--"]
[null,null,null,null,null,null,null,null,null,null,null,"--"]
["R35",{"$f":"IF(ISTEXT(VLOOKUP(A2626,'FICHA DE PROJETO'!$A$582:$I$761,2,FALSE)),VLOOKUP(A2626,'FICHA DE PROJETO'!$A$582:$I$761,2,FALSE),\"\")","v":""},null,null,null,null,null,null,null,null,null,{"$f":"IF((B2626=\"\"),\"--\",\"X\")","v":"--"}]
[null,null,"LEI",null,"PROJETO","ATENDEU À LEGISLAÇÃO",null,null,"NÃO ATENDEU À LEGISLAÇÃO",null,null,{"$f":"L2626","v":"--"}]
["Caracterização da Via: ",null,null,null,null,{"$f":"IF(ISBLANK(C2628),\"\",(IF((C2628=E2628),\"X\",\"\")))","v":""},null,null,{"$f":"IF(NOT(C2628=E2628),\"X\",\"\")","v":""},null,null,{"$f":"L2627","v":"--"}]
["Largura da Caixa da Via:",null,null,null,null,{"$f":"IF(ISBLANK(C2629),\"\",(IF((C2629<=E2629),\"X\",\"\")))","v":""},null,null,{"$f":"IF(ISBLANK(C2629),\"\",(IF((C2629>E2629),\"X\",\"\")))","v":""},null,null,"--"]
["Largura da Pista ",null,null,null,null,{"$f":"IF(ISBLANK(C2630),\"\",(IF((C2630<=E2630),\"X\",\"\")))","v":""},null,null,"",null,null,"--"]
["Largura da calçada",null,null,null,null,"",null,null,"",null,null,"--"]
["Largura do passeio",null,null,null,null,"",null,null,"",null,null,"--"]
["Ciclovia",null,null,null,null,"",null,null,"",null,null,"--"]
["Ciclofaixa",null,null,null,null,"",null,null,"",null,null,"--"]
[null,null,null,null,null,null,null,null,null,null,null,"--"]
["R36",{"$f":"IF(ISTEXT(VLOOKUP(A2636,'FICHA DE PROJETO'!$A$582:$I$761,2,FALSE)),VLOOKUP(A2636,'FICHA DE PROJETO'!$A$582:$I$761,2,FALSE),\"\")","v":""},null,null,null,null,null,null,null,null,null,{"$f":"IF((B2636=\"\"),\"--\",\"X\")","v":"--"}]
[null,null,"LEI",null,"PROJETO","ATENDEU À LEGISLAÇÃO",null,null,"NÃO ATENDEU À LEGISLAÇÃO",null,null,{"$f":"L2636","v":"--"}]
["Caracterização da Via: ",null,null,null,null,{"$f":"IF(ISBLANK(C2638),\"\",(IF((C2638=E2638),\"X\",\"\")))","v":""},null,null,{"$f":"IF(NOT(C2638=E2638),\"X\",\"\")","v":""},null,null,{"$f":"L2637","v":"--"}]
["Largura da Caixa da Via:",null,null,null,null,{"$f":"IF(ISBLANK(C2639),\"\",(IF((C2639<=E2639),\"X\",\"\")))","v":""},null,null,{"$f":"IF(ISBLANK(C2639),\"\",(IF((C2639>E2639),\"X\",\"\")))","v":""},null,null,"--"]
["Largura da Pista ",null,null,null,null,{"$f":"IF(ISBLANK(C2640),\"\",(IF((C2640<=E2640),\"X\",\"\")))","v":""},null,null,"",null,null,"--"]
["Largura da calçada",null,null,null,null,"",null,null,"",null,null,"--"]
["Largura do passeio",null,null,null,null,"",null,null,"",null,null,"--"]
["Ciclovia",null,null,null,null,"",null,null,"",null,null,"--"]
["Ciclofaixa",null,null,null,null,"",null,null,"",null,null,"--"]
[null,null,null,null,null,null,null,null,null,null,null,"--"]
["R37",{"$f":"IF(ISTEXT(VLOOKUP(A2646,'FICHA DE PROJETO'!$A$582:$I$761,2,FALSE)),VLOOKUP(A2646,'FICHA DE PROJETO'!$A$582:$I$761,2,FALSE),\"\")","v":""},null,null,null,null,null,null,null,null,null,{"$f":"IF((B2646=\"\"),\"--\",\"X\")","v":"--"}]
[null,null,"LEI",null,"PROJETO","ATENDEU À LEGISLAÇÃO",null,null,"NÃO ATENDEU À LEGISLAÇÃO",null,null,{"$f":"L2646","v":"--"}]
["Caracterização da Via: ",null,null,null,null,{"$f":"IF(ISBLANK(C2648),\"\",(IF((C2648=E2648),\"X\",\"\")))","v":""},null,null,{"$f":"IF(NOT(C2648=E2648),\"X\",\"\")","v":""},null,null,{"$f":"L2647","v":"--"}]
["Largura da Caixa da Via:",null,null,null,null,{"$f":"IF(ISBLANK(C2649),\"\",(IF((C2649<=E2649),\"X\",\"\")))","v":""},null,null,{"$f":"IF(ISBLANK(C2649),\"\",(IF((C2649>E2649),\"X\",\"\")))","v":""},null,null,"--"]
["Largura da Pista ",null,null,null,null,{"$f":"IF(ISBLANK(C2650),\"\",(IF((C2650<=E2650),\"X\",\"\")))","v":""},null,null,"",null,null,"--"]
["Largura da calçada",null,null,null,null,"",null,null,"",null,null,"--"]
["Largura do passeio",null,null,null,null,"",null,null,"",null,null,"--"]
["Ciclovia",null,null,null,null,"",null,null,"",null,null,"--"]
["Ciclofaixa",null,null,null,null,"",null,null,"",null,null,"--"]
[null,null,null,null,null,null,null,null,null,null,null,"--"]
["R38",{"$f":"IF(ISTEXT(VLOOKUP(A2656,'FICHA DE PROJETO'!$A$582:$I$761,2,FALSE)),VLOOKUP(A2656,'FICHA DE PROJETO'!$A$582:$I$761,2,FALSE),\"\")","v":""},null,null,null,null,null,null,null,null,null,{"$f":"IF((B2656=\"\"),\"--\",\"X\")","v":"--"}]
[null,null,"LEI",null,"PROJETO","ATENDEU À LEGISLAÇÃO",null,null,"NÃO ATENDEU À LEGISLAÇÃO",null,null,{"$f":"L2656","v":"--"}]
["Caracterização da Via: ",null,null,null,null,{"$f":"IF(ISBLANK(C2658),\"\",(IF((C2658=E2658),\"X\",\"\")))","v":""},null,null,{"$f":"IF(NOT(C2658=E2658),\"X\",\"\")","v":""},null,null,{"$f":"L2657","v":"--"}]
["Largura da Caixa da Via:",null,null,null,null,{"$f":"IF(ISBLANK(C2659),\"\",(IF((C2659<=E2659),\"X\",\"\")))","v":""},null,null,{"$f":"IF(ISBLANK(C2659),\"\",(IF((C2659>E2659),\"X\",\"\")))","v":""},null,null,"--"]
["Largura da Pista ",null,null,null,null,{"$f":"IF(ISBLANK(C2660),\"\",(IF((C2660<=E2660),\"X\",\"\")))","v":""},null,null,"",null,null,"--"]
["Largura da calçada",null,null,null,null,"",null,null,"",null,null,"--"]
["Largura do passeio",null,null,null,null,"",null,null,"",null,null,"--"]
["Ciclovia",null,null,null,null,"",null,null,"",null,null,"--"]
["Ciclofaixa",null,null,null,null,"",null,null,"",null,null,"--"]
[null,null,null,null,null,null,null,null,null,null,null,"--"]
["R39",{"$f":"IF(ISTEXT(VLOOKUP(A2666,'FICHA DE PROJETO'!$A$582:$I$761,2,FALSE)),VLOOKUP(A2666,'FICHA DE PROJETO'!$A$582:$I$761,2,FALSE),\"\")","v":""},null,null,null,null,null,null,null,null,null,{"$f":"IF((B2666=\"\"),\"--\",\"X\")","v":"--"}]
[null,null,"LEI",null,"PROJETO","ATENDEU À LEGISLAÇÃO",null,null,"NÃO ATENDEU À LEGISLAÇÃO",null,null,{"$f":"L2666","v":"--"}]
["Caracterização da Via: ",null,null,null,null,{"$f":"IF(ISBLANK(C2668),\"\",(IF((C2668=E2668),\"X\",\"\")))","v":""},null,null,{"$f":"IF(NOT(C2668=E2668),\"X\",\"\")","v":""},null,null,{"$f":"L2667","v":"--"}]
["Largura da Caixa da Via:",null,null,null,null,{"$f":"IF(ISBLANK(C2669),\"\",(IF((C2669<=E2669),\"X\",\"\")))","v":""},null,null,{"$f":"IF(ISBLANK(C2669),\"\",(IF((C2669>E2669),\"X\",\"\")))","v":""},null,null,"--"]
["Largura da Pista ",null,null,null,null,{"$f":"IF(ISBLANK(C2670),\"\",(IF((C2670<=E2670),\"X\",\"\")))","v":""},null,null,"",null,null,"--"]
["Largura da calçada",null,null,null,null,"",null,null,"",null,null,"--"]
["Largura do passeio",null,null,null,null,"",null,null,"",null,null,"--"]
["Ciclovia",null,null,null,null,"",null,null,"",null,null,"--"]
["Ciclofaixa",null,null,null,null,"",null,null,"",null,null,"--"]
[null,null,null,null,null,null,null,null,null,null,null,"--"]
["R40",{"$f":"IF(ISTEXT(VLOOKUP(A2676,'FICHA DE PROJETO'!$A$582:$I$761,2,FALSE)),VLOOKUP(A2676,'FICHA DE PROJETO'!$A$582:$I$761,2,FALSE),\"\")","v":""},null,null,null,null,null,null,null,null,null,{"$f":"IF((B2676=\"\"),\"--\",\"X\")","v":"--"}]
[null,null,"LEI",null,"PROJETO","ATENDEU À LEGISLAÇÃO",null,null,"NÃO ATENDEU À LEGISLAÇÃO",null,null,{"$f":"L2676","v":"--"}]
["Caracterização da Via: ",null,null,null,null,{"$f":"IF(ISBLANK(C2678),\"\",(IF((C2678=E2678),\"X\",\"\")))","v":""},null,null,{"$f":"IF(NOT(C2678=E2678),\"X\",\"\")","v":""},null,null,{"$f":"L2677","v":"--"}]
["Largura da Caixa da Via:",null,null,null,null,{"$f":"IF(ISBLANK(C2679),\"\",(IF((C2679<=E2679),\"X\",\"\")))","v":""},null,null,{"$f":"IF(ISBLANK(C2679),\"\",(IF((C2679>E2679),\"X\",\"\")))","v":""},null,null,"--"]
["Largura da Pista ",null,null,null,null,{"$f":"IF(ISBLANK(C2680),\"\",(IF((C2680<=E2680),\"X\",\"\")))","v":""},null,null,"",null,null,"--"]
["Largura da calçada",null,null,null,null,"",null,null,"",null,null,"--"]
["Largura do passeio",null,null,null,null,"",null,null,"",null,null,"--"]
["Ciclovia",null,null,null,null,"",null,null,"",null,null,"--"]
["Ciclofaixa",null,null,null,null,"",null,null,"",null,null,"--"]
[null,null,null,null,null,null,null,null,null,null,null,"--"]
["R41",{"$f":"IF(ISTEXT(VLOOKUP(A2686,'FICHA DE PROJETO'!$A$582:$I$761,2,FALSE)),VLOOKUP(A2686,'FICHA DE PROJETO'!$A$582:$I$761,2,FALSE),\"\")","v":""},null,null,null,null,null,null,null,null,null,{"$f":"IF((B2686=\"\"),\"--\",\"X\")","v":"--"}]
[null,null,"LEI",null,"PROJETO","ATENDEU À LEGISLAÇÃO",null,null,"NÃO ATENDEU À LEGISLAÇÃO",null,null,{"$f":"L2686","v":"--"}]
["Caracterização da Via: ",null,null,null,null,{"$f":"IF(ISBLANK(C2688),\"\",(IF((C2688=E2688),\"X\",\"\")))","v":""},null,null,{"$f":"IF(NOT(C2688=E2688),\"X\",\"\")","v":""},null,null,{"$f":"L2687","v":"--"}]
["Largura da Caixa da Via:",null,null,null,null,{"$f":"IF(ISBLANK(C2689),\"\",(IF((C2689<=E2689),\"X\",\"\")))","v":""},null,null,{"$f":"IF(ISBLANK(C2689),\"\",(IF((C2689>E2689),\"X\",\"\")))","v":""},null,null,"--"]
["Largura da Pista ",null,null,null,null,{"$f":"IF(ISBLANK(C2690),\"\",(IF((C2690<=E2690),\"X\",\"\")))","v":""},null,null,"",null,null,"--"]
["Largura da calçada",null,null,null,null,"",null,null,"",null,null,"--"]
["Largura do passeio",null,null,null,null,"",null,null,"",null,null,"--"]
["Ciclovia",null,null,null,null,"",null,null,"",null,null,"--"]
["Ciclofaixa",null,null,null,null,"",null,null,"",null,null,"--"]
[null,null,null,null,null,null,null,null,null,null,null,"--"]
["R42",{"$f":"IF(ISTEXT(VLOOKUP(A2696,'FICHA DE PROJETO'!$A$582:$I$761,2,FALSE)),VLOOKUP(A2696,'FICHA DE PROJETO'!$A$582:$I$761,2,FALSE),\"\")","v":""},null,null,null,null,null,null,null,null,null,{"$f":"IF((B2696=\"\"),\"--\",\"X\")","v":"--"}]
[null,null,"LEI",null,"PROJETO","ATENDEU À LEGISLAÇÃO",null,null,"NÃO ATENDEU À LEGISLAÇÃO",null,null,{"$f":"L2696","v":"--"}]
["Caracterização da Via: ",null,null,null,null,{"$f":"IF(ISBLANK(C2698),\"\",(IF((C2698=E2698),\"X\",\"\")))","v":""},null,null,{"$f":"IF(NOT(C2698=E2698),\"X\",\"\")","v":""},null,null,{"$f":"L2697","v":"--"}]
["Largura da Caixa da Via:",null,null,null,null,{"$f":"IF(ISBLANK(C2699),\"\",(IF((C2699<=E2699),\"X\",\"\")))","v":""},null,null,{"$f":"IF(ISBLANK(C2699),\"\",(IF((C2699>E2699),\"X\",\"\")))","v":""},null,null,"--"]
["Largura da Pista ",null,null,null,null,{"$f":"IF(ISBLANK(C2700),\"\",(IF((C2700<=E2700),\"X\",\"\")))","v":""},null,null,"",null,null,"--"]
["Largura da calçada",null,null,null,null,"",null,null,"",null,null,"--"]
["Largura do passeio",null,null,null,null,"",null,null,"",null,null,"--"]
["Ciclovia",null,null,null,null,"",null,null,"",null,null,"--"]
["Ciclofaixa",null,null,null,null,"",null,null,"",null,null,"--"]
[null,null,null,null,null,null,null,null,null,null,null,"--"]
["R43",{"$f":"IF(ISTEXT(VLOOKUP(A2706,'FICHA DE PROJETO'!$A$582:$I$761,2,FALSE)),VLOOKUP(A2706,'FICHA DE PROJETO'!$A$582:$I$761,2,FALSE),\"\")","v":""},null,null,null,null,null,null,null,null,null,{"$f":"IF((B2706=\"\"),\"--\",\"X\")","v":"--"}]
[null,null,"LEI",null,"PROJETO","ATENDEU À LEGISLAÇÃO",null,null,"NÃO ATENDEU À LEGISLAÇÃO",null,null,{"$f":"L2706","v":"--"}]
["Caracterização da Via: ",null,null,null,null,{"$f":"IF(ISBLANK(C2708),\"\",(IF((C2708=E2708),\"X\",\"\")))","v":""},null,null,{"$f":"IF(NOT(C2708=E2708),\"X\",\"\")","v":""},null,null,{"$f":"L2707","v":"--"}]
["Largura da Caixa da Via:",null,null,null,null,{"$f":"IF(ISBLANK(C2709),\"\",(IF((C2709<=E2709),\"X\",\"\")))","v":""},null,null,{"$f":"IF(ISBLANK(C2709),\"\",(IF((C2709>E2709),\"X\",\"\")))","v":""},null,null,"--"]
["Largura da Pista ",null,null,null,null,{"$f":"IF(ISBLANK(C2710),\"\",(IF((C2710<=E2710),\"X\",\"\")))","v":""},null,null,"",null,null,"--"]
["Largura da calçada",null,null,null,null,"",null,null,"",null,null,"--"]
["Largura do passeio",null,null,null,null,"",null,null,"",null,null,"--"]
["Ciclovia",null,null,null,null,"",null,null,"",null,null,"--"]
["Ciclofaixa",null,null,null,null,"",null,null,"",null,null,"--"]
[null,null,null,null,null,null,null,null,null,null,null,"--"]
["R44",{"$f":"IF(ISTEXT(VLOOKUP(A2716,'FICHA DE PROJETO'!$A$582:$I$761,2,FALSE)),VLOOKUP(A2716,'FICHA DE PROJETO'!$A$582:$I$761,2,FALSE),\"\")","v":""},null,null,null,null,null,null,null,null,null,{"$f":"IF((B2716=\"\"),\"--\",\"X\")","v":"--"}]
[null,null,"LEI",null,"PROJETO","ATENDEU À LEGISLAÇÃO",null,null,"NÃO ATENDEU À LEGISLAÇÃO",null,null,{"$f":"L2716","v":"--"}]
["Caracterização da Via: ",null,null,null,null,{"$f":"IF(ISBLANK(C2718),\"\",(IF((C2718=E2718),\"X\",\"\")))","v":""},null,null,{"$f":"IF(NOT(C2718=E2718),\"X\",\"\")","v":""},null,null,{"$f":"L2717","v":"--"}]
["Largura da Caixa da Via:",null,null,null,null,{"$f":"IF(ISBLANK(C2719),\"\",(IF((C2719<=E2719),\"X\",\"\")))","v":""},null,null,{"$f":"IF(ISBLANK(C2719),\"\",(IF((C2719>E2719),\"X\",\"\")))","v":""},null,null,"--"]
["Largura da Pista ",null,null,null,null,{"$f":"IF(ISBLANK(C2720),\"\",(IF((C2720<=E2720),\"X\",\"\")))","v":""},null,null,"",null,null,"--"]
["Largura da calçada",null,null,null,null,"",null,null,"",null,null,"--"]
["Largura do passeio",null,null,null,null,"",null,null,"",null,null,"--"]
["Ciclovia",null,null,null,null,"",null,null,"",null,null,"--"]
["Ciclofaixa",null,null,null,null,"",null,null,"",null,null,"--"]
[null,null,null,null,null,null,null,null,null,null,null,"--"]
["R45",{"$f":"IF(ISTEXT(VLOOKUP(A2726,'FICHA DE PROJETO'!$A$582:$I$761,2,FALSE)),VLOOKUP(A2726,'FICHA DE PROJETO'!$A$582:$I$761,2,FALSE),\"\")","v":""},null,null,null,null,null,null,null,null,null,{"$f":"IF((B2726=\"\"),\"--\",\"X\")","v":"--"}]
[null,null,"LEI",null,"PROJETO","ATENDEU À LEGISLAÇÃO",null,null,"NÃO ATENDEU À LEGISLAÇÃO",null,null,{"$f":"L2726","v":"--"}]
["Caracterização da Via: ",null,null,null,null,{"$f":"IF(ISBLANK(C2728),\"\",(IF((C2728=E2728),\"X\",\"\")))","v":""},null,null,{"$f":"IF(NOT(C2728=E2728),\"X\",\"\")","v":""},null,null,{"$f":"L2727","v":"--"}]
["Largura da Caixa da Via:",null,null,null,null,{"$f":"IF(ISBLANK(C2729),\"\",(IF((C2729<=E2729),\"X\",\"\")))","v":""},null,null,{"$f":"IF(ISBLANK(C2729),\"\",(IF((C2729>E2729),\"X\",\"\")))","v":""},null,null,"--"]
["Largura da Pista ",null,null,null,null,{"$f":"IF(ISBLANK(C2730),\"\",(IF((C2730<=E2730),\"X\",\"\")))","v":""},null,null,"",null,null,"--"]
["Largura da calçada",null,null,null,null,"",null,null,"",null,null,"--"]
["Largura do passeio",null,null,null,null,"",null,null,"",null,null,"--"]
["Ciclovia",null,null,null,null,"",null,null,"",null,null,"--"]
["Ciclofaixa",null,null,null,null,"",null,null,"",null,null,"--"]
[null,null,null,null,null,null,null,null,null,null,null,"--"]
["R46",{"$f":"IF(ISTEXT(VLOOKUP(A2736,'FICHA DE PROJETO'!$A$582:$I$761,2,FALSE)),VLOOKUP(A2736,'FICHA DE PROJETO'!$A$582:$I$761,2,FALSE),\"\")","v":""},null,null,null,null,null,null,null,null,null,{"$f":"IF((B2736=\"\"),\"--\",\"X\")","v":"--"}]
[null,null,"LEI",null,"PROJETO","ATENDEU À LEGISLAÇÃO",null,null,"NÃO ATENDEU À LEGISLAÇÃO",null,null,{"$f":"L2736","v":"--"}]
["Caracterização da Via: ",null,null,null,null,{"$f":"IF(ISBLANK(C2738),\"\",(IF((C2738=E2738),\"X\",\"\")))","v":""},null,null,{"$f":"IF(NOT(C2738=E2738),\"X\",\"\")","v":""},null,null,{"$f":"L2737","v":"--"}]
["Largura da Caixa da Via:",null,null,null,null,{"$f":"IF(ISBLANK(C2739),\"\",(IF((C2739<=E2739),\"X\",\"\")))","v":""},null,null,{"$f":"IF(ISBLANK(C2739),\"\",(IF((C2739>E2739),\"X\",\"\")))","v":""},null,null,"--"]
["Largura da Pista ",null,null,null,null,{"$f":"IF(ISBLANK(C2740),\"\",(IF((C2740<=E2740),\"X\",\"\")))","v":""},null,null,"",null,null,"--"]
["Largura da calçada",null,null,null,null,"",null,null,"",null,null,"--"]
["Largura do passeio",null,null,null,null,"",null,null,"",null,null,"--"]
["Ciclovia",null,null,null,null,"",null,null,"",null,null,"--"]
["Ciclofaixa",null,null,null,null,"",null,null,"",null,null,"--"]
[null,null,null,null,null,null,null,null,null,null,null,"--"]
["R47",{"$f":"IF(ISTEXT(VLOOKUP(A2746,'FICHA DE PROJETO'!$A$582:$I$761,2,FALSE)),VLOOKUP(A2746,'FICHA DE PROJETO'!$A$582:$I$761,2,FALSE),\"\")","v":""},null,null,null,null,null,null,null,null,null,{"$f":"IF((B2746=\"\"),\"--\",\"X\")","v":"--"}]
[null,null,"LEI",null,"PROJETO","ATENDEU À LEGISLAÇÃO",null,null,"NÃO ATENDEU À LEGISLAÇÃO",null,null,{"$f":"L2746","v":"--"}]
["Caracterização da Via: ",null,null,null,null,{"$f":"IF(ISBLANK(C2748),\"\",(IF((C2748=E2748),\"X\",\"\")))","v":""},null,null,{"$f":"IF(NOT(C2748=E2748),\"X\",\"\")","v":""},null,null,{"$f":"L2747","v":"--"}]
["Largura da Caixa da Via:",null,null,null,null,{"$f":"IF(ISBLANK(C2749),\"\",(IF((C2749<=E2749),\"X\",\"\")))","v":""},null,null,{"$f":"IF(ISBLANK(C2749),\"\",(IF((C2749>E2749),\"X\",\"\")))","v":""},null,null,"--"]
["Largura da Pista ",null,null,null,null,{"$f":"IF(ISBLANK(C2750),\"\",(IF((C2750<=E2750),\"X\",\"\")))","v":""},null,null,"",null,null,"--"]
["Largura da calçada",null,null,null,null,"",null,null,"",null,null,"--"]
["Largura do passeio",null,null,null,null,"",null,null,"",null,null,"--"]
["Ciclovia",null,null,null,null,"",null,null,"",null,null,"--"]
["Ciclofaixa",null,null,null,null,"",null,null,"",null,null,"--"]
[null,null,null,null,null,null,null,null,null,null,null,"--"]
["R48",{"$f":"IF(ISTEXT(VLOOKUP(A2756,'FICHA DE PROJETO'!$A$582:$I$761,2,FALSE)),VLOOKUP(A2756,'FICHA DE PROJETO'!$A$582:$I$761,2,FALSE),\"\")","v":""},null,null,null,null,null,null,null,null,null,{"$f":"IF((B2756=\"\"),\"--\",\"X\")","v":"--"}]
[null,null,"LEI",null,"PROJETO","ATENDEU À LEGISLAÇÃO",null,null,"NÃO ATENDEU À LEGISLAÇÃO",null,null,{"$f":"L2756","v":"--"}]
["Caracterização da Via: ",null,null,null,null,{"$f":"IF(ISBLANK(C2758),\"\",(IF((C2758=E2758),\"X\",\"\")))","v":""},null,null,{"$f":"IF(NOT(C2758=E2758),\"X\",\"\")","v":""},null,null,{"$f":"L2757","v":"--"}]
["Largura da Caixa da Via:",null,null,null,null,{"$f":"IF(ISBLANK(C2759),\"\",(IF((C2759<=E2759),\"X\",\"\")))","v":""},null,null,{"$f":"IF(ISBLANK(C2759),\"\",(IF((C2759>E2759),\"X\",\"\")))","v":""},null,null,"--"]
["Largura da Pista ",null,null,null,null,{"$f":"IF(ISBLANK(C2760),\"\",(IF((C2760<=E2760),\"X\",\"\")))","v":""},null,null,"",null,null,"--"]
["Largura da calçada",null,null,null,null,"",null,null,"",null,null,"--"]
["Largura do passeio",null,null,null,null,"",null,null,"",null,null,"--"]
["Ciclovia",null,null,null,null,"",null,null,"",null,null,"--"]
["Ciclofaixa",null,null,null,null,"",null,null,"",null,null,"--"]
[null,null,null,null,null,null,null,null,null,null,null,"--"]
["R49",{"$f":"IF(ISTEXT(VLOOKUP(A2766,'FICHA DE PROJETO'!$A$582:$I$761,2,FALSE)),VLOOKUP(A2766,'FICHA DE PROJETO'!$A$582:$I$761,2,FALSE),\"\")","v":""},null,null,null,null,null,null,null,null,null,{"$f":"IF((B2766=\"\"),\"--\",\"X\")","v":"--"}]
[null,null,"LEI",null,"PROJETO","ATENDEU À LEGISLAÇÃO",null,null,"NÃO ATENDEU À LEGISLAÇÃO",null,null,{"$f":"L2766","v":"--"}]
["Caracterização da Via: ",null,null,null,null,{"$f":"IF(ISBLANK(C2768),\"\",(IF((C2768=E2768),\"X\",\"\")))","v":""},null,null,{"$f":"IF(NOT(C2768=E2768),\"X\",\"\")","v":""},null,null,{"$f":"L2767","v":"--"}]
["Largura da Caixa da Via:",null,null,null,null,{"$f":"IF(ISBLANK(C2769),\"\",(IF((C2769<=E2769),\"X\",\"\")))","v":""},null,null,{"$f":"IF(ISBLANK(C2769),\"\",(IF((C2769>E2769),\"X\",\"\")))","v":""},null,null,"--"]
["Largura da Pista ",null,null,null,null,{"$f":"IF(ISBLANK(C2770),\"\",(IF((C2770<=E2770),\"X\",\"\")))","v":""},null,null,"",null,null,"--"]
["Largura da calçada",null,null,null,null,"",null,null,"",null,null,"--"]
["Largura do passeio",null,null,null,null,"",null,null,"",null,null,"--"]
["Ciclovia",null,null,null,null,"",null,null,"",null,null,"--"]
["Ciclofaixa",null,null,null,null,"",null,null,"",null,null,"--"]
[null,null,null,null,null,null,null,null,null,null,null,"--"]
["R50",{"$f":"IF(ISTEXT(VLOOKUP(A2776,'FICHA DE PROJETO'!$A$582:$I$761,2,FALSE)),VLOOKUP(A2776,'FICHA DE PROJETO'!$A$582:$I$761,2,FALSE),\"\")","v":""},null,null,null,null,null,null,null,null,null,{"$f":"IF((B2776=\"\"),\"--\",\"X\")","v":"--"}]
[null,null,"LEI",null,"PROJETO","ATENDEU À LEGISLAÇÃO",null,null,"NÃO ATENDEU À LEGISLAÇÃO",null,null,{"$f":"L2776","v":"--"}]
["Caracterização da Via: ",null,null,null,null,{"$f":"IF(ISBLANK(C2778),\"\",(IF((C2778=E2778),\"X\",\"\")))","v":""},null,null,{"$f":"IF(NOT(C2778=E2778),\"X\",\"\")","v":""},null,null,{"$f":"L2777","v":"--"}]
["Largura da Caixa da Via:",null,null,null,null,{"$f":"IF(ISBLANK(C2779),\"\",(IF((C2779<=E2779),\"X\",\"\")))","v":""},null,null,{"$f":"IF(ISBLANK(C2779),\"\",(IF((C2779>E2779),\"X\",\"\")))","v":""},null,null,"--"]
["Largura da Pista ",null,null,null,null,{"$f":"IF(ISBLANK(C2780),\"\",(IF((C2780<=E2780),\"X\",\"\")))","v":""},null,null,"",null,null,"--"]
["Largura da calçada",null,null,null,null,"",null,null,"",null,null,"--"]
["Largura do passeio",null,null,null,null,"",null,null,"",null,null,"--"]
["Ciclovia",null,null,null,null,"",null,null,"",null,null,"--"]
["Ciclofaixa",null,null,null,null,"",null,null,"",null,null,"--"]
[null,null,null,null,null,null,null,null,null,null,null,"--"]
["07. CARACTERÍSTICAS DO PROJETO"]
[]
[null,null,null,null,null,null,null,null,"SIM","NÃO"]
["7.1","A Localização do projeto proposto está inserido no Perímetro Urbano?",null,null,null,null,null,null,"X"]
["7.2","As vias do projeto estão localizadas em loteamento aprovado?",null,null,null,null,null,null,"X"]
["7.3","No caso de construção de dispositivos de drenagem de águas pluviais, o trecho está associado com via a ser pavimentada?",null,null,null,null,null,null,"X"]
["7.4","Há compatibilidade do projeto de pavimentação com os parâmetros estabelecidos no Plano de Arborização ou legislação específica que discipline plantio de espécies vegetais no Município?",null,null,null,null,null,null,null,"X"]
[null,"Justifique:"]
[]
[]
["7.5","Tipo de leito atual da via a ser pavimentada",null,null,null,null,"Revestimento primário / Leito natural"]
["7.6","Tipo de revestimento do projeto de pavimentação",null,null,null,null,"CBUQ - Concreto Betuminoso Usinado a Quente"]
[]
["08. INFRAESTRUTURA NA VIA A SER PAVIMENTADA"]
[]
[null,null,null,null,null,null,null,null,"SIM","NÃO"]
["8.1","Sistema de drenagem pluvial",null,null,null,null,null,null,null,"X"]
["8.2","Rede de esgoto",null,null,null,null,null,null,null,"X"]
["8.3","Rede de abastecimento de água",null,null,null,null,null,null,"X"]
["8.4","As calçadas estão delimitadas por meio-fio existente?"]
["8.5","Os meios-fios necessitarão ser substituídos?",null,null,null,null,null,null,null,"X"]
[null,"Justifique a situação por rua:"]
[]
[]
[]
[]
["8.6","Os passeios existentes (parte destinada ao trânsito de pedestres) estão em conformidade com a ABNT NBR 9050:2015/2020 e/ou Lei Municipal específica?",null,null,null,null,null,null,"X"]
[null,"Justifique a situação por rua:"]
[]
[]
[]
[]
["8.7","Os passeios existente necessitarão ser substituídos?",null,null,null,null,null,null,null,"X"]
[null,"Justifique a situação por rua:"]
[]
[]
[]
[]
["8.8","No caso de recapeamento, é necessário considerar tapa buracos?",null,null,null,null,null,null,null,"X"]
[null,"Justifique:"]
[]
[]
["09. IDENTIFICAÇÃO DA VIA A SER PAVIMENTADA"]
["INSERIR MAPA"]
["10. PARECER FINAL ",null,null,null,null,null,"FAVORÁVEL","X","DESFAVORÁVEL"]
["Considerações técnicas:"]
["Vias localizadas na sede do Município com médio adensamento populacional, cuja a pavimentação asfáltica e urbanização dos passeios, proporcionarão melhores condições de mobilidade, segurança e conseqüentemente melhor conforto e qualidade de vida à população."]
[]
[null,{"$f":"'FICHA DE PROJETO'!A799","v":"CAFEARA"},{"$f":"TODAY()","v":"2023-07-14"}]
[]
[]
[{"$f":"\"Eu, \"&B2842&\" abaixo assinado(a), representante do Município \"&B6& \" neste processo, DECLARO para os devidos fins, que as informações prestadas são verdadeiras, e que para o preenchimento e a emissão do presente Parecer Técnico\"&\" foi realizada visita 'in loco' na(s) área(s) em que será implantado o Projeto Executivo em pauta, com a finalidade de realizar o levantamento das características específicas locais, \"&\"constatar possíveis infraestruturas existentes, e de justificar os serviços previstos no projeto.\"&\" Por ser expressão da verdade, assino abaixo:\"","v":"Eu, Engenheiro Civil abaixo assinado(a), representante do Município CAFEARA neste processo, DECLARO para os devidos fins, que as informações prestadas são verdadeiras, e que para o preenchimento e a emissão do presente Parecer Técnico foi realizada visita 'in loco' na(s) área(s) em que será implantado o Projeto Executivo em pauta, com a finalidade de realizar o levantamento das características específicas locais, constatar possíveis infraestruturas existentes, e de justificar os serviços previstos no projeto. Por ser expressão da verdade, assino abaixo:"}]
[]
[]
[]
[null,{"$f":"B13","v":"Luiz Eduardo Candido"}]
[null,{"$f":"H15","v":"Engenheiro Civil"}]
[null,{"$f":"B15","v":"CREA PR - 145.164/D"}]
[]
[]
["Atesto para os devidos fins, que foram consideradas exclusivamente as informações repassadas pelo Município, presentes neste Relatório Técnico, certificadas pelo representante do Município, na Declaração acima assinada, e que, atendem aos critérios de elegililidade e estão compatíveis com o  projeto apresentado."]
[]
[]
[]
[null,null,{"$f":"'FICHA DE PROJETO'!H802","v":"Nelson Macedo Novaes"}]
[null,null,{"$f":"'FICHA DE PROJETO'!H803","v":"Engenheiro Civil"}]
[null,null,{"$f":"'FICHA DE PROJETO'!H804","v":"CREA PR-14.941/D"}]

{"sheet":"QUESTIONÁRIO AMBIENTAL","index":3,"n_rows":214,"n_cols":14,"rows_kept":214,"cut":false,"hidden":false,"merged":[[112,1,112,7],[114,1,114,9],[113,0,114,0],[113,1,113,9],[128,0,130,0],[136,1,136,7],[135,8,136,8],[84,0,86,0],[119,9,120,9],[122,8,123,8],[122,9,123,9],[122,0,124,0],[135,9,136,9],[127,1,127,7],[128,1,128,7],[116,0,116,9],[119,1,119,7],[106,0,106,9],[96,1,96,7],[97,1,97,7],[98,1,98,7],[119,8,120,8],[88,0,90,0],[132,0,132,9],[157,9,158,9],[160,0,162,0],[161,1,161,7],[141,1,141,7],[141,0,143,0],[154,1,154,7],[155,1,155,7],[157,1,157,7],[138,0,140,0],[139,1,139,7],[138,8,139,8],[138,9,139,9],[141,8,142,8],[198,0,198,9],[141,9,142,9],[142,1,142,7],[175,1,175,9],[159,1,159,9],[143,1,143,9],[145,1,145,7],[146,1,146,7],[147,1,147,7],[144,1,144,7],[148,1,148,7],[160,1,160,7],[166,1,166,7],[173,0,173,9],[150,0,150,9],[153,1,153,7],[156,1,156,7],[157,0,159,0],[157,8,158,8],[196,2,196,5],[190,0,190,9],[191,0,191,9],[175,0,177,0],[178,0,180,0],[0,0,0,1],[0,2,0,7],[0,8,0,9],[3,0,3,9],[5,1,5,4],[5,7,5,9],[83,1,83,9],[86,1,86,9],[14,1,14,2],[14,7,14,9],[16,1,16,4],[16,7,16,9],[19,0,19,9],[21,0,21,9],[9,2,9,3],[9,7,9,9],[12,1,12,4],[12,7,12,9],[27,7,27,9],[69,0,69,9],[62,0,62,9],[81,0,83,0],[26,1,26,3],[7,1,7,4],[27,5,27,6],[23,1,23,3],[26,7,26,9],[193,0,193,9],[194,0,194,9],[192,0,192,9],[54,1,54,7],[55,1,55,7],[188,0,188,9],[189,0,189,9],[56,1,56,7],[47,0,47,9],[50,1,50,7],[51,1,51,7],[52,1,52,7],[53,1,53,7],[46,1,46,7],[29,0,29,9],[32,1,32,7],[72,1,72,7],[119,0,121,0],[66,1,66,7],[187,0,187,9],[181,0,183,0],[177,1,177,9],[178,1,178,9],[180,1,180,9],[181,1,181,9],[183,1,183,9],[184,1,184,9],[179,1,179,9],[176,1,176,9],[182,1,182,9],[186,1,186,9],[185,1,185,9],[184,0,186,0],[73,1,73,7],[84,1,84,7],[81,1,81,7],[87,1,87,7],[90,1,90,9],[81,8,82,8],[81,9,82,9],[84,8,85,8],[84,9,85,9],[88,8,89,8],[88,9,89,9],[164,1,164,7],[109,1,109,7],[110,1,110,7],[111,1,111,7],[100,0,100,9],[103,1,103,7],[104,1,104,7],[88,1,88,7],[92,0,92,9],[95,1,95,7],[135,0,137,0],[135,1,135,7],[138,1,138,7],[137,1,137,9],[140,1,140,9],[122,1,122,7],[125,1,125,7],[126,1,126,7],[121,1,121,9],[124,1,124,9],[27,1,27,3],[129,1,129,9],[130,1,130,9],[65,1,65,7],[32,8,33,8],[67,1,67,7],[42,1,42,9],[45,1,45,9],[37,1,37,7],[74,1,74,7],[76,0,76,9],[79,1,79,7],[80,1,80,7],[40,8,41,8],[40,9,41,9],[50,8,51,8],[50,9,51,9],[52,8,53,8],[32,9,33,9],[33,1,33,7],[34,1,34,9],[32,0,34,0],[35,1,35,9],[36,1,36,9],[35,0,36,0],[58,1,58,7],[58,8,59,8],[58,9,59,9],[39,1,39,9],[37,8,38,8],[37,9,38,9],[43,8,44,8],[43,9,44,9],[37,0,39,0],[57,1,57,7],[56,8,57,8],[56,9,57,9],[40,0,42,0],[43,0,45,0],[52,9,53,9],[54,8,55,8],[54,9,55,9],[214,1,214,4],[214,5,214,10],[207,0,207,9],[160,8,161,8],[160,9,161,9],[162,1,162,9],[58,0,60,0],[59,1,59,7],[60,1,60,9],[163,0,164,0],[163,8,164,8],[163,9,164,9],[165,1,165,9],[168,1,168,9],[170,1,170,7],[167,1,167,7],[166,0,168,0],[169,0,171,0],[171,1,171,9],[169,8,170,8],[166,8,167,8],[166,9,167,9],[169,9,170,9],[169,1,169,7]]}
[null,null,"Governo do Estado do Paraná\nSecretaria das Cidades\nRua Jacy Loureiro de Campos, nº 180| 2º andar | Centro Cívico  CEP 80530-140 | Caixa Postal 15079\nCuritiba | Paraná | Fone (41) 3350 – 3300  http://www.paranacidade.org.br/"]
[]
[]
["QUESTIONÁRIO AMBIENTAL"]
[]
["Município:",{"$f":"'FICHA DE PROJETO'!B6","v":"CAFEARA"},null,null,null,null,"CNPJ:",{"$f":"'FICHA DE PROJETO'!H6","v":75845545000106},null,null,null,null,null,"Formatação do CNPJ:      00\".\"000\".\"000\"/\"0000-00"]
[]
[{"$f":"'FICHA DE PROJETO'!A8","v":"Projeto:"},{"$f":"'FICHA DE PROJETO'!B8","v":"Pavimentação Asfáltica em CBUQ"},null,null,null,null,"Componente: ",{"$f":"'FICHA DE PROJETO'!H8","v":"Sistema Viário"}]
[]
[{"$f":"'FICHA DE PROJETO'!A10","v":"Prioridade:"},{"$f":"'FICHA DE PROJETO'!B10","v":49},{"$f":"'FICHA DE PROJETO'!C10","v":"Programa"},null,{"$f":"'FICHA DE PROJETO'!E10","v":"PAM"},null,"Convênio:",{"$f":"'FICHA DE PROJETO'!H10","v":0}]
[]
[]
["Contato:",{"$f":"'FICHA DE PROJETO'!B15","v":"Luiz Eduardo Candido"},null,null,null,null,"CPF:",{"$f":"'FICHA DE PROJETO'!H15","v":"063.225.***"}]
[]
["CAU/CREA:",{"$f":"'FICHA DE PROJETO'!B17","v":"CREA PR - 145.164/D"},null,null,null,null,"Cargo:",{"$f":"'FICHA DE PROJETO'!H17","v":"Engenheiro Civil"}]
[]
["e-mail:",{"$f":"'FICHA DE PROJETO'!B19","v":"lecandido.candido@gmail.com"},null,null,null,null,"Telefone:",{"$f":"'FICHA DE PROJETO'!H19","v":"(44) 98409-2602"}]
[]
[]
["01. DESCRIÇÃO DO OBJETO"]
[]
[{"$f":"'FICHA DE PROJETO'!A24","v":"Pavimentação de vias urbanas em CBUQ,  10.892,70 m2, incluindo serviços preliminares, terraplenagem, base e sub-base, revestimento, meio-fio e sarjeta, urbanização, sinalização de trânsito, drenagem e ensaios tecnológicos."}]
[]
["Área Pavimentada",{"$f":"'FICHA DE PROJETO'!C764","v":10892.7}]
[]
["No caso de abertura de rua (via nova em terreno limpo):"]
["Área do Terreno","<área (m²)>",null,null,null,null,"Área Construída","<área (m²)>"]
["Matrícula do Terreno","<número da matrícula>",null,null,null,"Cartório",null,"<Número do ofício e Comarca>"]
[]
["02. DIAGNÓSTICO AMBIENTAL"]
[]
[null,null,null,null,null,null,null,null,"SIM","NÃO"]
["a","O Município possui legislação ambiental?",null,null,null,null,null,null,null,"X"]
[null,"Caso afirmativo, informe o número da Lei Municipal"]
[]
["b","Informe as Leis Estaduais e Federais aplicáveis:"]
[]
["c","O empreendimento necessita de Autorização ou Licença Ambiental?",null,null,null,null,null,null,null,"X"]
[null,"Caso afirmativo, informe o número do documento:"]
[]
["d","O empreendimento necessita de PCA/EIA RIMA?",null,null,null,null,null,null,null,"X"]
[null,"Caso afirmativo, informe o número do documento:"]
[]
["e","O empreendimento necessita de Estudo de Impacto de Vizinhança - EIV?",null,null,null,null,null,null,null,"X"]
[null,"Caso afirmativo, informe o número do documento e legislação municipal pertinente:"]
[]
[]
["2.1 O PROJETO SITUA-SE EM:"]
[]
[null,null,null,null,null,null,null,null,"SIM","NÃO"]
["a","Área de manancial de abastecimento de água",null,null,null,null,null,null,null,"X"]
["b","Área de reflorestamento de araucária (espécies com mais de 30 anos)"]
["c","Área de influência de manguezais",null,null,null,null,null,null,null,"X"]
["d","Área de várzea"]
["e","Unidades de Conservação",null,null,null,null,null,null,null,"X"]
["f","Encostas com declividade superior a 30%"]
["g","Áreas de preservação permanente ou APA",null,null,null,null,null,null,null,"X"]
["h","Área de vulnerabilidade social/ambiental por enchentes, desequilíbrios climáticos, área de encosta sujeita a deslizamentos?"]
["i","Área com indícios de possível contaminação do solo do terreno ou logradouro por descarte de efluentes no solo ou esgoto a céu aberto, manchas no solo, odores de substâncias químicas, alterações na vegetação, ocorrência de animais mortos, vazamento ou derramamento de substâncias químicas, odor de gás e/ou combustível, ou quando nas áreas anexas, ou no próprio imóvel no passado, tiveram atividades como posto de gasolina, armazenamento de resíduos, indústrias poluentes, e similares, atero com entulho?",null,null,null,null,null,null,null,"X"]
[null,"Caso afirmativo, justifique quais:"]
[]
[]
["2.2 SISTEMAS/FONTES DE ÁGUA EXISTENTES"]
[]
[null,null,null,null,null,null,null,null,"SIM","NÃO"]
["a","Poço individual",null,null,null,null,null,null,null,"X"]
["b","Fonte Superficial individual",null,null,null,null,null,null,null,"X"]
["c","Ligação com rede de abastecimento de água",null,null,null,null,null,null,"X"]
[]
["2.3 SISTEMAS DE COLETA DE ESGOTO EXISTENTES"]
[]
[null,null,null,null,null,null,null,null,"SIM","NÃO"]
["a","Existe rede de esgoto pública com tratamento?",null,null,null,null,null,null,null,"X"]
["b","Existe fossa Séptica Individual?",null,null,null,null,null,null,"X"]
["c","Existe fossa Séptica Coletiva?",null,null,null,null,null,null,null,"X"]
[]
["2.4 SISTEMAS/GALERIAS DE ÁGUAS PLUVIAIS EXISTENTES"]
[]
[null,null,null,null,null,null,null,null,"SIM","NÃO"]
["a","Rede de Galerias de Àguas Pluviais",null,null,null,null,null,null,null,"X"]
["b","Rede existente suporta novas inclusões?",null,null,null,null,null,null,null,"X"]
["c","Rede existente está funcionando corretamente? "]
[null,"Justifique:"]
[]
["d","Haverá aproveitamento da rede existente no projeto?",null,null,null,null,null,null,"X"]
[null,"Justifique:"]
[]
["e","Possui dissipadores de energia (croqui de Localização utilizando o Google Earth ou o SEDU PARANACIDADE Interativo)",null,null,null,null,null,null,"X"]
["f","Dissipadores existentes estão funcionando corretamente e regularizado ambientalmente? ",null,null,null,null,null,null,"X"]
[null,"Justifique:"]
[]
[]
["2.5 REDE DE DISTRIBUIÇÃO DE ENERGIA ELÉTRICA EXISTENTES"]
[]
[null,null,null,null,null,null,null,null,"SIM","NÃO"]
["a","Média Tensão",null,null,null,null,null,null,null,"X"]
["b","Baixa Tensão",null,null,null,null,null,null,"X"]
["c","Captação de Energia Solar",null,null,null,null,null,null,null,"X"]
["d","Micro Sistemas de Energia",null,null,null,null,null,null,null,"X"]
[]
["2.6 SISTEMA DE ILUMINAÇÃO PÚBLICA EXISTENTES"]
[]
[null,null,null,null,null,null,null,null,"SIM","NÃO"]
["a","Iluminação Pública Convencional",null,null,null,null,null,null,null,"X"]
["b","Iluminação Pública em LED",null,null,null,null,null,null,"X"]
[]
["2.7 SISTEMA DE COLETA DE RESÍDUOS SÓLIDOS E DOMÉSTICOS EXISTENTES"]
[]
[null,null,null,null,null,null,null,null,"SIM","NÃO"]
["a","Coleta de Resíduos Domésticos",null,null,null,null,null,null,"X"]
["b","Coleta Seletiva de Resíduos Sólidos ",null,null,null,null,null,null,"X"]
["c","Coleta de Resíduos Sólidos Hospitalares",null,null,null,null,null,null,null,"X"]
["d","Coleta de Resíduos Perigosos",null,null,null,null,null,null,null,"X"]
["f","Frequência de coleta (na área do projeto) e disposição dos resíduos (aterro sanitário/ aterro controlado/ aterro sem controle/ lixão)"]
[null,"Coleta duas (2) vezes por semana. Disposição em aterro controlado e separação de recicláveis."]
[]
["2.8 OUTRAS CARACTERÍSTICAS DO LOCAL ONDE SERÁ EXECUTADO O EMPREENDIMENTO"]
[]
[null,null,null,null,null,null,null,null,"SIM","NÃO"]
["a","Atividades econômicas",null,null,null,null,null,null,null,"X"]
[null,"Descreva:"]
[]
["b","População local",null,null,null,null,null,null,"X"]
[null,"Descreva:"]
[]
["c","Possui vegetação nativa?",null,null,null,null,null,null,null,"X"]
["d","Presença de animais silvestres?",null,null,null,null,null,null,null,"X"]
["e","Necessidade de contenção de processos erosivos?",null,null,null,null,null,null,null,"X"]
["f","Possui área de bota-fora/ empréstimo, aprovado pelo orgão ambiental municipal? ",null,null,null,null,null,null,null,"X"]
[null,"Insira o croqui de localização do bota fora/empréstimo utilizando o Google Earth ou o SEDU PARANACIDADE Interativo"]
[]
[]
["3.  IMPACTO AMBIENTAL"]
[]
[null,null,null,null,null,null,null,null,"SIM","NÃO"]
["a","Requer desmate? ",null,null,null,null,null,null,null,"X"]
[null,"Caso afirmativo, especifique as áreas:"]
[]
["b","Gera resíduos sólidos? ",null,null,null,null,null,null,null,"X"]
[null,"Caso afirmativo, especifique os tipos e volumes:"]
[]
["c","Requer movimentação de terras? ",null,null,null,null,null,null,"X"]
[null,"Caso afirmativo, especifique o volume:"]
[]
["d","Qual impacto da obra na qualidade dos recursos ambientais existentes:"]
["e","Modificações do uso do solo",null,null,null,null,null,null,null,"X"]
["f","Favorecimento de dispersão de vegetação exótica",null,null,null,null,null,null,null,"X"]
["g","Assoreamento de rios",null,null,null,null,null,null,null,"X"]
["h","Contaminação de águas subtrrâneas e superficiais",null,null,null,null,null,null,null,"X"]
[]
["4. IMPACTOS SOCIAIS/ECONÔMICOS"]
[]
[null,null,null,null,null,null,null,null,"SIM","NÃO"]
["a","Haverá aumento de renda regional, local e das arrecadações públicas?",null,null,null,null,null,null,"X"]
["b","Impacto positivo da obra na saúde, segurança e bem estar da população?",null,null,null,null,null,null,"X"]
["c","Valorização imobiliária do entorno?",null,null,null,null,null,null,"X"]
["d","Incentivo ao Turismo Regional?",null,null,null,null,null,null,null,"X"]
["e","Há sítios arqueológicos e históricos?",null,null,null,null,null,null,null,"X"]
[null,"Justifique:"]
[]
["f","Haverá transtornos aos moradores diretamente afetado? ",null,null,null,null,null,null,"X"]
[null,"Caso afirmativo, justifique se serão temporários (durante a execução da obra) ou permanentes"]
[null,"Transtornos temporários durante a execução da obra."]
["g","Alteração no sistema viário e tráfego local?",null,null,null,null,null,null,"X"]
[null,"Caso afirmativo, justifique se serão temporários (durante a execução da obra) ou permanentes"]
[null,"Transtornos temporários durante a execução da obra."]
["h","Poluição sonora? (equipamentos, maquinários)",null,null,null,null,null,null,"X"]
[null,"Caso afirmativo, justifique se serão temporários (durante a execução da obra) ou permanentes"]
[null,"Transtornos temporários durante a execução da obra."]
["i","Alteração na qualidade do ar, solos e recursos hídricos em função da instalação do canteiro?",null,null,null,null,null,null,null,"X"]
[null,"Caso afirmativo, justifique se serão temporários (durante a execução da obra) ou permanentes"]
[]
[]
["5.  MEDIDAS DE MITIGAÇÃO AOS IMPACTOS AMBIENTAIS"]
[]
["a","Quanto a alteração da qualidade ambiental dos solos (contaminação com óleos lubrificantes, combustíveis ou outros produtos químicos, coleta de lixo existente, coleta de esgoto residencial)."]
[null,"Descreva como irá ocorrer:"]
[null,"Não há."]
["b","Quanto a poluição atmosférica (controle de velocidade de veículos, manutenção dos veículos)."]
[null,"Descreva como irá ocorrer:"]
[null,"Não há."]
["c","Quanto a alteração da qualidade dos recursos hídricos (coleta de lixo e esgoto residencial, drenagem superficial, uso de pavimentos permeáveis)."]
[null,"Descreva como irá ocorrer:"]
[null,"Não há."]
["d","Quanto a supressão de vegetação (arborização no entorno do empreendimento)"]
[null,"Descreva como irá ocorrer:"]
[null,"Não há."]
["5.1. OUTRAS CARACTERÍSTICAS"]
[]
[]
[]
[]
["6. CROQUI DE LOCALIZAÇÃO (utilizando o Google Earth ou o SEDU PARANACIDADE Interativo)"]
[]
[]
[]
[null,{"$f":"'FICHA DE PROJETO'!A799","v":"CAFEARA"},{"$f":"TODAY()","v":"2023-07-14"}]
[]
[{"$f":"\"Eu, \"&B204&\" abaixo assinado(a), representante do Município \"&B6& \" neste processo, DECLARO para os devidos fins, que as informações prestadas são verdadeiras, e que para o preenchimento e a emissão do presente Parecer Técnico\"&\" foi realizada visita 'in loco' na(s) área(s) em que será implantado o Projeto Executivo em pauta, com a finalidade de realizar o levantamento das características específicas locais, \"&\"constatar possíveis infraestruturas existentes, e de justificar os serviços previstos no projeto.\"&\" Por ser expressão da verdade, assino abaixo:\"","v":"Eu, Engenheiro Civil abaixo assinado(a), representante do Município CAFEARA neste processo, DECLARO para os devidos fins, que as informações prestadas são verdadeiras, e que para o preenchimento e a emissão do presente Parecer Técnico foi realizada visita 'in loco' na(s) área(s) em que será implantado o Projeto Executivo em pauta, com a finalidade de realizar o levantamento das características específicas locais, constatar possíveis infraestruturas existentes, e de justificar os serviços previstos no projeto. Por ser expressão da verdade, assino abaixo:"}]
[]
[]
[]
[null,{"$f":"B13","v":"Luiz Eduardo Candido"}]
[null,{"$f":"H15","v":"Engenheiro Civil"}]
[null,{"$f":"B15","v":"CREA PR - 145.164/D"}]
[]
[]
["Atesto para os devidos fins, que foram consideradas exclusivamente as informações repassadas pelo Município, presentes neste Relatório Técnico, certificadas pelo representante do Município, na Declaração acima assinada, e que, atendem aos critérios de elegililidade e estão compatíveis com o  projeto apresentado."]
[]
[]
[]
[null,null,{"$f":"'FICHA DE PROJETO'!H802","v":"Nelson Macedo Novaes"}]
[null,null,{"$f":"'FICHA DE PROJETO'!H803","v":"Engenheiro Civil"}]
[null,null,{"$f":"'FICHA DE PROJETO'!H804","v":"CREA PR-14.941/D"}]

{"sheet":"RELATÓRIO FOTOGRÁFICO","index":4,"n_rows":90,"n_cols":8,"rows_kept":90,"cut":false,"hidden":false,"merged":[[341,0,341,4],[341,5,341,9],[342,0,342,4],[342,5,342,9],[320,0,320,4],[320,5,320,9],[321,0,321,4],[321,5,321,9],[322,0,340,4],[322,5,340,9],[299,0,299,4],[299,5,299,9],[300,0,300,4],[300,5,300,9],[301,0,319,4],[301,5,319,9],[278,0,278,4],[278,5,278,9],[279,0,279,4],[279,5,279,9],[280,0,298,4],[280,5,298,9],[257,0,257,4],[257,5,257,9],[258,5,258,9],[258,0,258,4],[259,0,277,4],[259,5,277,9],[216,0,216,4],[216,5,216,9],[236,0,236,4],[236,5,236,9],[237,0,237,4],[237,5,237,9],[238,0,256,4],[238,5,256,9],[217,0,235,4],[217,5,235,9],[152,0,152,4],[152,5,152,9],[153,0,153,4],[153,5,153,9],[173,0,173,4],[173,5,173,9],[111,0,111,4],[111,5,111,9],[131,0,131,4],[131,5,131,9],[132,0,132,4],[132,5,132,9],[112,0,130,4],[112,5,130,9],[133,0,151,4],[133,5,151,9],[154,0,172,4],[154,5,172,9],[89,0,89,4],[90,0,90,4],[89,5,89,9],[90,5,90,9],[110,0,110,4],[110,5,110,9],[48,5,48,9],[48,0,48,4],[69,0,69,4],[69,5,69,9],[68,0,68,4],[68,5,68,9],[49,0,67,4],[49,5,67,9],[70,0,88,4],[70,5,88,9],[91,0,109,4],[91,5,109,9],[26,0,26,4],[26,5,26,9],[27,0,27,4],[27,5,27,9],[47,0,47,4],[47,5,47,9],[0,0,0,1],[0,2,0,7],[0,8,0,9],[3,0,3,9],[5,1,5,4],[5,7,5,9],[7,0,25,4],[7,5,25,9],[28,0,46,4],[28,5,46,9],[215,0,215,4],[215,5,215,9],[175,0,193,4],[175,5,193,9],[196,0,214,4],[196,5,214,9],[174,0,174,4],[174,5,174,9],[194,0,194,4],[194,5,194,9],[195,0,195,4],[195,5,195,9],[343,0,361,4],[343,5,361,9],[362,0,362,4],[362,5,362,9],[363,0,363,4],[363,5,363,9],[364,0,382,4],[364,5,382,9],[383,0,383,4],[383,5,383,9],[384,0,384,4],[384,5,384,9],[385,0,403,4],[385,5,403,9],[404,0,404,4],[404,5,404,9],[405,0,405,4],[405,5,405,9],[406,0,424,4],[406,5,424,9],[425,0,425,4],[425,5,425,9],[426,0,426,4],[426,5,426,9],[427,0,445,4],[427,5,445,9],[446,0,446,4],[446,5,446,9],[447,0,447,4],[447,5,447,9],[509,0,509,4],[509,5,509,9],[510,0,510,4],[510,5,510,9],[448,0,466,4],[448,5,466,9],[467,0,467,4],[467,5,467,9],[468,0,468,4],[468,5,468,9],[469,0,487,4],[469,5,487,9],[488,0,488,4],[488,5,488,9],[489,0,489,4],[489,5,489,9],[490,0,508,4],[490,5,508,9]]}
[null,null,"Governo do Estado do Paraná\nSecretaria das Cidades\nRua Jacy Loureiro de Campos, nº 180| 2º andar | Centro Cívico  CEP 80530-140 | Caixa Postal 15079\nCuritiba | Paraná | Fone (41) 3350 – 3300  http://www.paranacidade.org.br/"]
[]
[]
["RELATÓRIO FOTOGRÁFICO"]
[]
["Município:",{"$f":"'FICHA DE PROJETO'!B6","v":"CAFEARA"},null,null,null,null,"Projeto:",{"$f":"'FICHA DE PROJETO'!B8","v":"Pavimentação Asfáltica em CBUQ"}]
[]
[]
[]
[]
[]
[]
[]
[]
[]
[]
[]
[]
[]
[]
[]
[]
[]
[]
[]
[]
["TRECHO 01",null,null,null,null,"TRECHO 02"]
[]
[]
[]
[]
[]
[]
[]
[]
[]
[]
[]
[]
[]
[]
[]
[]
[]
[]
[]
[]
["TRECHO 03",null,null,null,null,"TRECHO 04"]
[]
[]
[]
[]
[]
[]
[]
[]
[]
[]
[]
[]
[]
[]
[]
[]
[]
[]
[]
[]
["TRECHO 05",null,null,null,null,"TRECHO 06"]
[]
[]
[]
[]
[]
[]
[]
[]
[]
[]
[]
[]
[]
[]
[]
[]
[]
[]
[]
[]
["TRECHO 07",null,null,null,null,"TRECHO 08"]

{"sheet":"ANÁLISE TÉCNICA","index":5,"n_rows":134,"n_cols":10,"rows_kept":134,"cut":false,"hidden":false,"merged":[[121,11,121,20],[122,11,122,20],[123,11,123,20],[124,11,124,20],[125,11,125,20],[126,11,126,20],[115,0,115,7],[118,11,118,20],[119,11,119,12],[119,14,119,15],[119,18,119,19],[120,11,120,20],[118,0,118,1],[118,3,118,4],[118,7,118,8],[119,0,119,9],[116,0,116,7],[106,0,106,7],[107,0,107,7],[108,0,108,7],[109,0,109,7],[110,0,110,7],[61,0,61,7],[62,0,62,7],[63,0,63,7],[64,0,64,7],[65,0,65,7],[66,0,66,7],[67,0,67,7],[68,0,68,7],[96,0,96,7],[97,0,97,7],[92,0,92,7],[93,0,93,7],[94,0,94,7],[90,0,90,7],[91,0,91,7],[88,0,88,7],[89,0,89,7],[86,0,86,7],[87,0,87,7],[28,0,28,7],[29,0,29,7],[31,0,31,7],[32,0,32,7],[117,0,117,7],[128,2,128,4],[123,0,123,9],[124,0,124,9],[125,0,125,9],[121,0,121,9],[122,0,122,9],[120,0,120,9],[112,0,112,7],[113,0,113,7],[114,0,114,7],[111,0,111,7],[102,0,102,7],[103,0,103,7],[104,0,104,7],[100,0,100,7],[101,0,101,7],[98,0,98,7],[99,0,99,7],[105,0,105,7],[82,0,82,7],[83,0,83,7],[84,0,84,7],[80,0,80,7],[81,0,81,7],[78,0,78,7],[79,0,79,7],[76,0,76,7],[77,0,77,7],[47,0,47,7],[72,0,72,7],[73,0,73,7],[74,0,74,7],[70,0,70,7],[71,0,71,7],[69,0,69,7],[60,0,60,7],[58,0,58,7],[59,0,59,7],[55,0,55,7],[33,0,33,7],[30,0,30,7],[75,0,75,7],[85,0,85,7],[95,0,95,7],[43,0,43,7],[44,0,44,7],[42,0,42,7],[45,0,45,7],[41,0,41,7],[40,0,40,7],[39,0,39,7],[37,0,37,7],[54,0,54,7],[56,0,56,7],[57,0,57,7],[52,0,52,7],[53,0,53,7],[50,0,50,7],[51,0,51,7],[48,0,48,7],[49,0,49,7],[38,0,38,7],[46,0,46,7],[36,0,36,7],[35,0,35,7],[27,0,27,7],[0,0,0,1],[0,2,0,7],[0,8,0,9],[3,0,3,9],[5,1,5,4],[5,7,5,9],[25,0,25,9],[16,1,16,2],[16,7,16,9],[18,1,18,4],[18,7,18,9],[21,0,21,9],[23,0,23,9],[7,1,7,4],[9,2,9,3],[9,7,9,9],[11,1,11,4],[11,7,11,9],[14,1,14,4],[14,7,14,9],[34,0,34,7]]}
[null,null,"Governo do Estado do Paraná\nSecretaria das Cidades\nRua Jacy Loureiro de Campos, nº 180| 2º andar | Centro Cívico  CEP 80530-140 | Caixa Postal 15079\nCuritiba | Paraná | Fone (41) 3350 – 3300  http://www.paranacidade.org.br/"]
[]
[]
["ANÁLISE TÉCNICA"]
[]
["Município:",{"$f":"'FICHA DE PROJETO'!B6","v":"CAFEARA"},null,null,null,null,"CNPJ:",{"$f":"'FICHA DE PROJETO'!H6","v":75845545000106}]
[]
[{"$f":"'FICHA DE PROJETO'!A8","v":"Projeto:"},{"$f":"'FICHA DE PROJETO'!B8","v":"Pavimentação Asfáltica em CBUQ"},null,null,null,null,"Componente: ",{"$f":"'FICHA DE PROJETO'!H8","v":"Sistema Viário"}]
[]
[{"$f":"'FICHA DE PROJETO'!A10","v":"Prioridade:"},{"$f":"'FICHA DE PROJETO'!B10","v":49},{"$f":"'FICHA DE PROJETO'!C10","v":"Programa"},null,{"$f":"'FICHA DE PROJETO'!E10","v":"PAM"},null,"Convênio:",{"$f":"'FICHA DE PROJETO'!H10","v":0}]
[]
["Valor do Repasse:",{"$f":"'FICHA DE PROJETO'!B12","v":0},null,null,null,null,"Contrapartida:",{"$f":"'FICHA DE PROJETO'!H12","v":0}]
[]
[]
["Contato:",{"$f":"'FICHA DE PROJETO'!B15","v":"Luiz Eduardo Candido"},null,null,null,null,"CPF:",{"$f":"'FICHA DE PROJETO'!H15","v":"063.225.***"}]
[]
["CAU/CREA:",{"$f":"'FICHA DE PROJETO'!B17","v":"CREA PR - 145.164/D"},null,null,null,null,"Cargo:",{"$f":"'FICHA DE PROJETO'!H17","v":"Engenheiro Civil"}]
[]
["e-mail:",{"$f":"'FICHA DE PROJETO'!B19","v":"lecandido.candido@gmail.com"},null,null,null,null,"Telefone:",{"$f":"'FICHA DE PROJETO'!H19","v":"(44) 98409-2602"}]
[]
[]
["01. DESCRIÇÃO DO OBJETO"]
[]
[{"$f":"'FICHA DE PROJETO'!A24","v":"Pavimentação de vias urbanas em CBUQ,  10.892,70 m2, incluindo serviços preliminares, terraplenagem, base e sub-base, revestimento, meio-fio e sarjeta, urbanização, sinalização de trânsito, drenagem e ensaios tecnológicos."}]
[]
["02. DOCUMENTOS NECESSÁRIOS"]
[]
["DESCRIÇÃO DO DOCUMENTO SOLICITADO",null,null,null,null,null,null,null,"SIM","NÃO"]
["Observância às diretrizes do Plano Diretor de Uso e Ocupação do Solo Municipal (Plano de Ações)"]
["Observância à lei do sistema viário, de parcelamento do solo urbano e de uso e ocupação do solo (ou compatibilidade com a hierarquia das vias ou predominância do uso do solo)"]
["ART - Cada projeto deverá vir acompanhado com a respectiva ART:",null,null,null,null,null,null,null,"SIM","NÃO"]
["·   Dimensionamento do Pavimento (cálculo para espessuras das camadas do pavimento)."]
["·   Sondagem do Solo."]
["·   Orçamento."]
["·   Cronograma Físico / Financeiro."]
["·   Projeto de Arruamento."]
["·   Terraplenagem."]
["·   Drenagem."]
["·   Teste de Carga /ou Ensaio de Viga Benkelman, para Avaliação do Suporte de Cargas (para recapeamentos)."]
["·   Compatibilidade de Projetos."]
["Planta de Situação com indicação do perímetro urbano (por meio da base cartográfica urbana digital, se existente e atualizada)."]
["Planta de Localização das ruas do projeto e seu entorno imediato (indicação de áreas pavimentadas e sem pavimentação)."]
["Cópia da Matrícula do Registro de Imóveis atualizada do terreno em nome do Município, ou Termo de Imissão de Posse emitido pelo Poder Judiciário, ou Declaração de Concordância do proprietário, acompanhado de cópia do Decreto Municipal de Desapropriação do Imóvel e da Escritura de Compromisso de Compra e Venda, no caso de implantação de via."]
["Autorização do DNIT/ DER/PR e/ou concessionárias para a realização da obra quando as vias estiverem sujeitas à fiscalização / operação dessas entidades."]
["Parecer Urbanístico (incluindo fotos) preenchido pelo analista do PARANACIDADE em visita ao local para levantamento da situação existente."]
["Questionário Ambiental preenchido pelo projetista."]
["Laudo de Sondagem do Solo, compreendendo: croqui indicando furos, no mínimo, a cada 200 metros e nos pontos críticos (solos moles, rocha, etc.), classificação do solo das camadas existentes e determinação do nível da água."]
["Laudo do Índice de Suporte do Sub-Leito (CBR ou penetrômetro dinâmico de ponta cônica), no caso de pavimentos rígidos e flexíveis (asfálticos)."]
["Projeto de Pavimentação: ",null,null,null,null,null,null,null,"SIM","NÃO"]
["·   Dimensionamento do Pavimento (Memória de Cálculo e Metodologia)."]
["·   Justificativa das espessuras das camadas, no caso de calçamento."]
["·   Estudo de volume de tráfego e memória de cálculo, no caso de pavimento asfáltico."]
["·   Projeto de Terraplanagem: indicando volumes de corte e aterro (tabela por trechos)."]
["Projeto Geométrico: apresentando planta e perfil longitudinal do eixo:",null,null,null,null,null,null,null,"SIM","NÃO"]
["a)       Planta (layout das vias) – Escala 1:750 "]
["b)       Perfil longitudinal do eixo – Escala Vertical 1:1000 – e Escala Horizontal 1:750 ou 1:1000"]
["·   Projeto de Detalhes por rua: "]
["a)       seção transversal"]
["b)       largura da pista de rolamento (entre sarjetas)"]
["c)       largura da caixa de rolamento (entre espelhos de meios-fios)"]
["d)       largura da caixa da via (entre prediais)"]
["e)       declividade transversal da pista"]
["f)        detalhamento das camadas do pavimento (especificação e espessura)"]
["g)       detalhe do meio-fio e sarjeta."]
["h)      detalhamento do passeio (largura do piso da calçada em concreto e largura da grama)"]
["·   Projeto de Interseções: apresentando detalhe dos cruzamentos das vias e especificando raio de curvatura (por meio da base cartográfica urbana digital, se existente e atualizada)."]
["·   Detalhe das Áreas de Estacionamento, se necessário."]
["Projetos de Sinalização Regulamentar de Trânsito (Código de Trânsito Brasileiro)",null,null,null,null,null,null,null,"SIM","NÃO"]
["·   Sinalização Horizontal"]
["·   Sinalização Vertical"]
["·   Sinalização Semafórica (para veículos e pedestres)"]
["Projeto de Drenagem",null,null,null,null,null,null,null,"SIM","NÃO"]
["·   Estudo de vazões das bacias de contribuição."]
["·   Memória de cálculo da vazão (Tabela de dimensionamento dos diâmetros dos tubos)."]
["·   Traçado das galerias, incluindo emissário final, com indicação de comprimento, diâmetro, declividade, vazão e indicação do sentido do escoamento."]
["·   Perfil longitudinal, com indicação do volume de escavação."]
["·   Detalhes de poços de visita, bocas de lobo e caixas de ligação."]
["·   Detalhe dos dissipadores de energia, se necessário;"]
["·   Indicação de escoamento superficial através das cotas do terreno – Curvas de Nível (Altimetria por meio da base cartográfica urbana digital, se existente e atualizada)."]
[". Para implantação de Emissário de águas pluviais: apresentação de Licenciamento Ambiental emitido pelo IAP, conforme determina o Instituto de Águas e Terras (Águas Paraná)."]
["·   No caso de galeria existente, apresentação de DECLARAÇÃO informando que a rede coletora é existente, encontra-se em funcionamento, ligada à emissário de águas pluviais implantado, dotado de dissipador de energia, regularizado ambientalmente, cuja manutenção é de responsabilidade da Administração Municipal."]
["Implantação de rede de drenagem através de terreno de propriedade privada (conforme Art. 1288 do Código Civil - Lei 10406/02)"]
["·   Projeto geométrico da rede ou emissário"]
["·   Lei que instituiu a servidão de passagem "]
["·   Cópia atualizada no Registro de Imóveis da Matrícula do terreno."]
["·   Autorização de Passagem assinada pelo Proprietário do terreno, com firma reconhecida em Cartório de Registro."]
["Projeto de Urbanização dos Passeios",null,null,null,null,null,null,null,"SIM","NÃO"]
["Projeto dos Passeios:"]
["a)       seção transversal da via."]
["b)       tipo de revestimento da calçada."]
["c)       largura do revestimento da calçada."]
["d)       largura da área permeável (grama)."]
["e)       seção transversal do piso (camadas do pavimento)."]
["f)        declividade transversal do passeio."]
["g)       guias rebaixadas."]
["h)       Rampa de Acessibilidade: atendimento à Norma da ABNT – NBR 9050/2020 – Acessibilidade de pessoas portadoras de deficiência física a edificações."]
["i)       atendimento à Norma da - ABNT – NBR 16537/2016 – Acessibilidade: Sinalização tátil no piso."]
["Projeto de Paisagismo (insumos de plantio):"]
["a)       insumos de plantio."]
["b)       designação das espécies vegetais a serem implantadas."]
["c)       detalhamento dos equipamentos de tutoramento e proteção."]
["d)       projeto dos Equipamento Urbano – detalhe das lixeiras; bancos; mobiliários diversos."]
["j)         locação das árvores."]
["k)        locação das lixeiras."]
["Memoriais Descritivos, incluindo o método executivo."]
["Caderno de Encargos – Especificações técnicas de serviços e relação de testes de materiais e execução (DER-PR ou DNIT)."]
["Orçamento - global por rua / trecho – com especificação de serviços e quantidade e custos unitários."]
["Compatibilidade com a geomorfologia e a disponibilidade de materiais na região – Relatório de DMT (Distância Média de Transporte) dos materiais."]
["Alíquota do ISSQN para serviços de Pavimentação Asfáltica."]
["Declaração do Departamento de Tributação da Prefeitura, informando alíquota (%) do tributo e a Base de Cálculo (% da mão-de-obra). Assinatura do Responsável e do Prefeito Municipal. "]
["Cronograma Físico-Financeiro."]
["Mapa com identificação dos lotes ocupados e vagos (por meio da base cartográfica urbana digital, quando existente e atualizada, e cadastro técnico imobiliário urbano)"]
["Levantamento do número de unidades imobiliárias dos lotes ocupados e identificação dos respectivos proprietários (com base no cadastro técnico imobiliário urbano)"]
["Planilha de Avaliação Econômica da solução técnica proposta."]
["Cópia do Capítulo da Contribuição de Melhoria do Código Tributário Municipal."]
["Cópia da aprovação do Loteamento (no caso de loteamento fora do quadro original do município) – se implantado nos últimos 15 anos. "]
["Consulta COPEL quanto à relocação de postes, alteração de redes e linhas aéreas."]
["Resposta das empresas responsáveis pela implantação / expansão das redes subterrâneas ao Protocolo de comunicação da realização da obra pelo Município."]
["SANEPAR",null,"SIM","COPEL",null,null,"SIM","OUTRAS",null,"NÃO"]
[]
[]
["Os projetos devem ser cadastrados no Portal dos Municípios em formato PDF, DWG e BIM (caso já tenham sido desenvolvidos nessa metodologia) na escala adequada ao pleno entendimento do objeto. "]
["O projeto deverá respeitar as Normas de Acessibilidade Universal"]
["Para a avaliação ambiental serão utilizadas as informações constantes no parecer urbanístico, questionário ambiental e outras intrínsecas ao rol de projetos e documentos acima."]
["Observações:"]
["A anotação “SIM”, referente a entrega do documento, indica que o mesmo foi apresentado. No entanto, não afirma que o documento esteja em conformidade, bem como não descarta a obrigatoriedade de correções, caso necessário, para atendimento integral do critério de elegebilidade específico."]
[]
[]
[null,{"$f":"'FICHA DE PROJETO'!A799","v":"CAFEARA"},{"$f":"TODAY()","v":"2023-07-14"}]
[]
[]
[null,null,null,null,null,null,null,{"$f":"'FICHA DE PROJETO'!H802","v":"Nelson Macedo Novaes"}]
[null,null,null,null,null,null,null,{"$f":"'FICHA DE PROJETO'!H803","v":"Engenheiro Civil"}]
[null,null,null,null,null,null,null,{"$f":"'FICHA DE PROJETO'!H804","v":"CREA PR-14.941/D"}]

{"sheet":"Municípios_CNPJ","index":6,"n_rows":402,"n_cols":6,"rows_kept":402,"cut":false,"hidden":true,"merged":[]}
[null,"Executor","Escritorio","Associação","Escritório Regional","CNPJ"]
[1,"Abatiá","Londrina","Associação dos Municípios do Norte Pioneiro","Escritório Regional de Londrina",75743567000157]
[{"$f":"A2+1","v":2},"Adrianópolis","Curitiba","Associação dos Municípios da Região Metropolitana de Curitiba","Escritório Regional de Curitiba",76105642000117]
[{"$f":"A3+1","v":3},"Agudos do Sul","Curitiba","Associação dos Municípios da Região Metropolitana de Curitiba","Escritório Regional de Curitiba",76105667000110]
[4,"Almirante Tamandaré","Curitiba","Associação dos Municípios da Região Metropolitana de Curitiba","Escritório Regional de Curitiba",76105659000174]
[5,"Altamira do Paraná","Guarapuava","Associação dos Municípios do Centro do Paraná","Escritório Regional de Guarapuava",78069143000147]
[6,"Alto Paraíso","Maringá","Associação dos Municípios da Região de Entre Rios","Escritório Regional de Maringá",95640736000130]
[7,"Alto Paraná","Maringá","Associação dos Municípios do Noroeste do Paraná","Escritório Regional de Maringá",76279967000116]
[8,"Alto Piquiri","Maringá","Associação dos Municípios da Região de Entre Rios","Escritório Regional de Maringá",76247352000108]
[9,"Altônia","Maringá","Associação dos Municípios da Região de Entre Rios","Escritório Regional de Maringá",81478059000191]
[10,"Alvorada do Sul","Londrina","Associação dos Municípios do Médio Paranapanema","Escritório Regional de Londrina",75132860000188]
[11,"Amaporã","Maringá","Associação dos Municípios do Noroeste do Paraná","Escritório Regional de Maringá",75475038000110]
[12,"Ampére","Francisco Beltrão","Associação dos Municípios do Sudoeste do Paraná","Escritório Regional de Francisco Betrão",77817054000179]
[13,"Anahy","Cascavel","Associação dos Municípios do Oeste do Paraná","Escritório Regional de Cascavel",95594800000194]
[14,"Andirá","Londrina","Associação dos Municípios do Norte Pioneiro","Escritório Regional de Londrina",76235761000194]
[15,"Ângulo","Maringá","Associação dos Municípos do Setentrião Paranaense","Escritório Regional de Maringá",95642286000115]
[16,"Antonina","Curitiba","Associação dos Municípios do Litoral do Paraná","Escritório Regional de Curitiba",76022516000107]
[17,"Antonio Olinto","Ponta Grossa","Associação dos Municípios do Sul do Paraná","Escritório Regional de Ponta Grossa",76020460000143]
[18,"Apucarana","Londrina","Associação dos Municípios do Vale do Ivaí","Escritório Regional de Londrina",75771253000168]
[19,"Arapongas","Londrina","Associação dos Municípios do Médio Paranapanema","Escritório Regional de Londrina",76958966000106]
[20,"Arapoti","Ponta Grossa","Associação dos Municípios da Região dos Campos Gerais","Escritório Regional de Ponta Grossa",75658377000131]
[21,"Arapuã","Londrina","Associação dos Municípios do Vale do Ivaí","Escritório Regional de Londrina","01612388000144"]
[22,"Araruna","Maringá","Comunidade dos Municípios da Região de Campo Mourão","Escritório Regional de Maringá",75359760000199]
[23,"Araucária","Curitiba","Associação dos Municípios da Região Metropolitana de Curitiba","Escritório Regional de Curitiba",76105535000199]
[24,"Ariranha do Ivaí","Londrina","Associação dos Municípios do Vale do Ivaí","Escritório Regional de Londrina","01612453000131"]
[25,"Assaí","Londrina","Associação dos Municípios do Norte do Paraná","Escritório Regional de Londrina",76290709000130]
[26,"Assis Chateaubriand","Cascavel","Associação dos Municípios do Oeste do Paraná","Escritório Regional de Cascavel",76208479000118]
[27,"Astorga","Maringá","Associação dos Municípos do Setentrião Paranaense","Escritório Regional de Maringá",75743377000130]
[28,"Atalaia","Maringá","Associação dos Municípos do Setentrião Paranaense","Escritório Regional de Maringá",75731018000162]
[29,"Balsa Nova","Curitiba","Associação dos Municípios da Região Metropolitana de Curitiba","Escritório Regional de Curitiba",76105527000142]
[30,"Bandeirantes","Londrina","Associação dos Municípios do Norte do Paraná","Escritório Regional de Londrina",76235753000148]
[31,"Barbosa Ferraz","Maringá","Comunidade dos Municípios da Região de Campo Mourão","Escritório Regional de Maringá",76950062000126]
[32,"Barra do Jacaré","Londrina","Associação dos Municípios do Norte Pioneiro","Escritório Regional de Londrina",76407568000193]
[33,"Barracão","Francisco Beltrão","Associação dos Municípios do Sudoeste do Paraná","Escritório Regional de Francisco Betrão",75666131000101]
[34,"Bela Vista da Caroba","Francisco Beltrão","Associação dos Municípios do Sudoeste do Paraná","Escritório Regional de Francisco Betrão","01612441000107"]
[35,"Bela Vista do Paraíso","Londrina","Associação dos Municípios do Médio Paranapanema","Escritório Regional de Londrina",76245067000158]
[36,"Bituruna","Guarapuava","Associação dos Municípios do Sul do Paraná","Escritório Regional de Guarapuava",81648859000103]
[37,"Boa Esperança","Maringá","Comunidade dos Municípios da Região de Campo Mourão","Escritório Regional de Maringá",76217017000167]
[38,"Boa Esperança do Iguaçu","Francisco Beltrão","Associação dos Municípios do Sudoeste do Paraná","Escritório Regional de Francisco Betrão",95589255000148]
[39,"Boa Ventura de São Roque","Guarapuava","Associação dos Municípios do Centro do Paraná","Escritório Regional de Guarapuava","01612906000120"]
[40,"Boa Vista da Aparecida","Cascavel","Associação dos Municípios do Oeste do Paraná","Escritório Regional de Cascavel",78121985000109]
[41,"Bocaiúva do Sul","Curitiba","Associação dos Municípios da Região Metropolitana de Curitiba","Escritório Regional de Curitiba",76105592000178]
[42,"Bom Jesus do Sul","Francisco Beltrão","Associação dos Municípios do Sudoeste do Paraná","Escritório Regional de Francisco Betrão","01612443000104"]
[43,"Bom Sucesso","Londrina","Associação dos Municípios do Vale do Ivaí","Escritório Regional de Londrina",75771261000104]
[44,"Bom Sucesso do Sul","Francisco Beltrão","Associação dos Municípios do Sudoeste do Paraná","Escritório Regional de Francisco Betrão",80874100000186]
[45,"Borrazópolis","Londrina","Associação dos Municípios do Vale do Ivaí","Escritório Regional de Londrina",75740829000120]
[46,"Braganey","Cascavel","Associação dos Municípios do Oeste do Paraná","Escritório Regional de Cascavel",78121902000173]
[47,"Brasilândia do Sul","Maringá","Associação dos Municípios da Região de Entre Rios","Escritório Regional de Maringá",95640520000175]
[48,"Cafeara","Londrina","Associação dos Municípios do Médio Paranapanema","Escritório Regional de Londrina",75845545000106]
[49,"Cafelândia","Cascavel","Associação dos Municípios do Oeste do Paraná","Escritório Regional de Cascavel",78121878000172]
[50,"Cafezal do Sul","Maringá","Associação dos Municípios da Região de Entre Rios","Escritório Regional de Maringá",95640652000105]
[51,"Califórnia","Londrina","Associação dos Municípios do Vale do Ivaí","Escritório Regional de Londrina",75771279000106]
[52,"Cambará","Londrina","Associação dos Municípios do Norte Pioneiro","Escritório Regional de Londrina",75442756000190]
[53,"Cambé","Londrina","Associação dos Municípios do Médio Paranapanema","Escritório Regional de Londrina",75732057000184]
[54,"Cambira","Londrina","Associação dos Municípios do Vale do Ivaí","Escritório Regional de Londrina",75771287000152]
[55,"Campina da Lagoa","Maringá","Comunidade dos Municípios da Região de Campo Mourão","Escritório Regional de Maringá",76950070000172]
[56,"Campina do Simão","Guarapuava","Associação dos Municípios do Centro do Paraná","Escritório Regional de Guarapuava",1611489000109]
[57,"Campina Grande do Sul","Curitiba","Associação dos Municípios da Região Metropolitana de Curitiba","Escritório Regional de Curitiba",76105600000186]
[58,"Campo Bonito","Cascavel","Associação dos Municípios do Oeste do Paraná","Escritório Regional de Cascavel",80869621000145]
[59,"Campo do Tenente","Curitiba","Associação dos Municípios da Região Suleste do Paraná","Escritório Regional de Curitiba",76002658000102]
[60,"Campo Largo","Curitiba","Associação dos Municípios da Região Metropolitana de Curitiba","Escritório Regional de Curitiba",76105618000188]
[61,"Campo Magro","Curitiba","Associação dos Municípios da Região Metropolitana de Curitiba","Escritório Regional de Curitiba","01607539000176"]
[62,"Campo Mourão","Guarapuava","Comunidade dos Municípios da Região de Campo Mourão","Escritório Regional de Maringá",75904524000106]
[63,"Cândido de Abreu","Guarapuava","Associação dos Municípios do Centro do Paraná","Escritório Regional de Guarapuava",76175926000180]
[64,"Candói","Guarapuava","Associação dos Municípios do Cantuquiriguaçu","Escritório Regional de Guarapuava",95684478000194]
[65,"Cantagalo","Guarapuava","Associação dos Municípios do Cantuquiriguaçu","Escritório Regional de Guarapuava",78279981000145]
[66,"Capanema","Francisco Beltrão","Associação dos Municípios do Sudoeste do Paraná","Escritório Regional de Francisco Betrão",75972760000160]
[{"$f":"A67+1","v":67},"Capitão Leônidas Marques","Cascavel","Associação dos Municípios do Oeste do Paraná","Escritório Regional de Cascavel",76208834000159]
[68,"Carambeí","Ponta Grossa","Associação dos Municípios da Região dos Campos Gerais","Escritório Regional de Ponta Grossa","01613765000160"]
[69,"Carlópolis","Londrina","Associação dos Municípios do Norte Pioneiro","Escritório Regional de Londrina",76965789000187]
[70,"Cascavel","Cascavel","Associação dos Municípios do Oeste do Paraná","Escritório Regional de Cascavel",76208867000107]
[71,"Castro","Ponta Grossa","Associação dos Municípios da Região dos Campos Gerais","Escritório Regional de Ponta Grossa",77001311000108]
[72,"Catanduvas","Cascavel","Associação dos Municípios do Oeste do Paraná","Escritório Regional de Cascavel",76208842000103]
[73,"Centenário do Sul","Londrina","Associação dos Municípios do Médio Paranapanema","Escritório Regional de Londrina",75845503000167]
[74,"Cerro Azul","Curitiba","Associação dos Municípios da Região Metropolitana de Curitiba","Escritório Regional de Curitiba",76105626000124]
[75,"Céu Azul","Cascavel","Associação dos Municípios do Oeste do Paraná","Escritório Regional de Cascavel",76206473000101]
[76,"Chopinzinho","Francisco Beltrão","Associação dos Municípios do Sudoeste do Paraná","Escritório Regional de Francisco Betrão",76995414000160]
[77,"Cianorte","Maringá","Associação dos Municípios da Região de Entre Rios","Escritório Regional de Maringá",76309806000128]
[78,"Cidade Gaúcha","Maringá","Associação dos Municípios da Região de Entre Rios","Escritório Regional de Maringá",75377200000167]
[79,"Clevelândia","Francisco Beltrão","Associação dos Municípios do Sudoeste do Paraná","Escritório Regional de Francisco Betrão",76161199000100]
[80,"Colombo","Curitiba","Associação dos Municípios da Região Metropolitana de Curitiba","Escritório Regional de Curitiba",76105634000170]
[81,"Colorado","Maringá","Associação dos Municípos do Setentrião Paranaense","Escritório Regional de Maringá",76970326000103]
[82,"Congonhinhas","Londrina","Associação dos Municípios do Norte do Paraná","Escritório Regional de Londrina",75825828000188]
[83,"Conselheiro Mairinck","Londrina","Associação dos Municípios do Norte Pioneiro","Escritório Regional de Londrina",75968412000119]
[84,"Contenda","Curitiba","Associação dos Municípios da Região Metropolitana de Curitiba","Escritório Regional de Curitiba",76105519000104]
[85,"Corbélia","Cascavel","Associação dos Municípios do Oeste do Paraná","Escritório Regional de Cascavel",76208826000102]
[86,"Cornélio Procópio","Londrina","Associação dos Municípios do Norte do Paraná","Escritório Regional de Londrina",76331941000170]
[87,"Coronel Domingos Soares","Francisco Beltrão","Associação dos Municípios do Sudoeste do Paraná","Escritório Regional de Francisco Betrão","01614415000118"]
[88,"Coronel Vivida","Francisco Beltrão","Associação dos Municípios do Sudoeste do Paraná","Escritório Regional de Francisco Betrão",76995455000156]
[89,"Corumbataí do Sul","Maringá","Comunidade dos Municípios da Região de Campo Mourão","Escritório Regional de Maringá",80888662000189]
[90,"Cruz Machado","Ponta Grossa","Associação dos Municípios do Sul do Paraná","Escritório Regional de Ponta Grossa",76339688000109]
[91,"Cruzeiro do Iguaçu","Francisco Beltrão","Associação dos Municípios do Sudoeste do Paraná","Escritório Regional de Francisco Betrão",95589230000144]
[92,"Cruzeiro do Oeste","Maringá","Associação dos Municípios da Região de Entre Rios","Escritório Regional de Maringá",76381854000127]
[93,"Cruzeiro do Sul","Maringá","Associação dos Municípios do Noroeste do Paraná","Escritório Regional de Maringá",75731034000155]
[94,"Cruzmaltina","Londrina","Associação dos Municípios do Vale do Ivaí","Escritório Regional de Londrina","01615393000100"]
[95,"Curitiba","Curitiba","Associação dos Municípios da Região Metropolitana de Curitiba","Escritório Regional de Curitiba",76417005000186]
[96,"Curiúva","Londrina","Associação dos Municípios do Norte do Paraná","Escritório Regional de Londrina",76167725000130]
[97,"Diamante do Norte","Maringá","Associação dos Municípios do Noroeste do Paraná","Escritório Regional de Maringá",76972082000106]
[98,"Diamante do Sul","Cascavel","Associação dos Municípios do Oeste do Paraná","Escritório Regional de Cascavel",95595120000195]
[99,"Diamante d'Oeste","Cascavel","Associação dos Municípios do Oeste do Paraná","Escritório Regional de Cascavel",77817476000144]
[100,"Dois Vizinhos","Francisco Beltrão","Associação dos Municípios do Sudoeste do Paraná","Escritório Regional de Francisco Betrão",76205640000108]
[101,"Douradina","Maringá","Associação dos Municípios da Região de Entre Rios","Escritório Regional de Maringá",78200110000194]
[102,"Doutor Camargo","Maringá","Associação dos Municípos do Setentrião Paranaense","Escritório Regional de Maringá",76282714000100]
[103,"Doutor Ulysses","Curitiba","Associação dos Municípios da Região Metropolitana de Curitiba","Escritório Regional de Curitiba",95422911000113]
[104,"Enéas Marques","Francisco Beltrão","Associação dos Municípios do Sudoeste do Paraná","Escritório Regional de Francisco Betrão",76205657000157]
[105,"Engenheiro Beltrão","Maringá","Comunidade dos Municípios da Região de Campo Mourão","Escritório Regional de Maringá",76950039000131]
[106,"Entre Rios do Oeste","Cascavel","Associação dos Municípios do Oeste do Paraná","Escritório Regional de Cascavel",95719449000110]
[107,"Esperança Nova","Maringá","Associação dos Municípios da Região de Entre Rios","Escritório Regional de Maringá","01612269000191"]
[108,"Espigão Alto do Iguaçu","Guarapuava","Associação dos Municípios do Cantuquiriguaçu","Escritório Regional de Guarapuava","01612634000168"]
[109,"Farol","Maringá","Comunidade dos Municípios da Região de Campo Mourão","Escritório Regional de Maringá",95640124000148]
[110,"Faxinal","Londrina","Associação dos Municípios do Vale do Ivaí","Escritório Regional de Londrina",75771295000107]
[111,"Fazenda Rio Grande","Curitiba","Associação dos Municípios da Região Metropolitana de Curitiba","Escritório Regional de Curitiba",95422986000102]
[112,"Fênix","Maringá","Comunidade dos Municípios da Região de Campo Mourão","Escritório Regional de Maringá",76950021000130]
[113,"Fernandes Pinheiro","Ponta Grossa","Associação dos Municípios do Centro Sul do Paraná","Escritório Regional de Ponta Grossa","01619323000120"]
[114,"Figueira","Londrina","Associação dos Municípios do Norte Pioneiro","Escritório Regional de Londrina",78063732000118]
[115,"Flor da Serra do Sul","Francisco Beltrão","Associação dos Municípios do Sudoeste do Paraná","Escritório Regional de Francisco Betrão",95589271000130]
[116,"Floraí","Maringá","Associação dos Municípos do Setentrião Paranaense","Escritório Regional de Maringá",75731000000160]
[117,"Floresta","Maringá","Associação dos Municípos do Setentrião Paranaense","Escritório Regional de Maringá",76282706000155]
[118,"Florestópolis","Londrina","Associação dos Municípios do Médio Paranapanema","Escritório Regional de Londrina",75845495000159]
[119,"Flórida","Maringá","Associação dos Municípos do Setentrião Paranaense","Escritório Regional de Maringá",75772400000114]
[120,"Formosa do Oeste","Cascavel","Associação dos Municípios do Oeste do Paraná","Escritório Regional de Cascavel",76208495000100]
[121,"Foz do Iguaçu","Francisco Beltrão","Associação dos Municípios do Oeste do Paraná","Escritório Regional de Francisco Betrão",76206606000140]
[122,"Foz do Jordão","Guarapuava","Associação dos Municípios do Cantuquiriguaçu","Escritório Regional de Guarapuava","01603719000180"]
[123,"Francisco Alves","Maringá","Associação dos Municípios da Região de Entre Rios","Escritório Regional de Maringá",77356665000167]
[124,"Francisco Beltrão","Francisco Beltrão","Associação dos Municípios do Sudoeste do Paraná","Escritório Regional de Francisco Betrão",77816510000166]
[125,"General Carneiro","Guarapuava","Associação dos Municípios do Sul do Paraná","Escritório Regional de Guarapuava",75687681000107]
[126,"Godoy Moreira","Londrina","Associação dos Municípios do Vale do Ivaí","Escritório Regional de Londrina",81392656000107]
[127,"Goioerê","Maringá","Comunidade dos Municípios da Região de Campo Mourão","Escritório Regional de Maringá",78198975000163]
[128,"Goioxim","Guarapuava","Associação dos Municípios do Cantuquiriguaçu","Escritório Regional de Guarapuava","01607627000178"]
[129,"Grandes Rios","Londrina","Associação dos Municípios do Vale do Ivaí","Escritório Regional de Londrina",75741348000139]
[130,"Guaíra","Cascavel","Associação dos Municípios do Oeste do Paraná","Escritório Regional de Cascavel",77857183000190]
[{"$f":"A131+1","v":131},"Guairaçá","Maringá","Associação dos Municípios do Noroeste do Paraná","Escritório Regional de Maringá",76238443000187]
[132,"Guamiranga","Ponta Grossa","Associação dos Municípios do Centro Sul do Paraná","Escritório Regional de Ponta Grossa","01616255000146"]
[133,"Guapirama","Londrina","Associação dos Municípios do Norte Pioneiro","Escritório Regional de Londrina",75443812000100]
[134,"Guaporema","Maringá","Associação dos Municípios da Região de Entre Rios","Escritório Regional de Maringá",75378844000170]
[135,"Guaraci","Londrina","Associação dos Municípios do Médio Paranapanema","Escritório Regional de Londrina",75845537000151]
[136,"Guaraniaçu","Cascavel","Associação dos Municípios do Oeste do Paraná","Escritório Regional de Cascavel",76208818000166]
[137,"Guarapuava","Guarapuava","Associação dos Municípios do Centro do Paraná","Escritório Regional de Guarapuava",76178037000176]
[138,"Guaraqueçaba","Curitiba","Associação dos Municípios do Litoral do Paraná","Escritório Regional de Curitiba",76022508000152]
[139,"Guaratuba","Curitiba","Associação dos Municípios do Litoral do Paraná","Escritório Regional de Curitiba",76017474000108]
[140,"Honório Serpa","Francisco Beltrão","Associação dos Municípios do Sudoeste do Paraná","Escritório Regional de Francisco Betrão",95585444000142]
[141,"Ibaiti","Londrina","Associação dos Municípios do Norte Pioneiro","Escritório Regional de Londrina",77008068000141]
[142,"Ibema","Cascavel","Associação dos Municípios do Cantuquiriguaçu","Escritório Regional de Cascavel",80881931000185]
[143,"Ibiporã","Londrina","Associação dos Municípios do Médio Paranapanema","Escritório Regional de Londrina",76244961000103]
[144,"Icaraíma","Maringá","Associação dos Municípios da Região de Entre Rios","Escritório Regional de Maringá",76247337000160]
[145,"Iguaraçu","Maringá","Associação dos Municípos do Setentrião Paranaense","Escritório Regional de Maringá",75772525000144]
[146,"Iguatu","Cascavel","Associação dos Municípios do Oeste do Paraná","Escritório Regional de Cascavel",95595013000167]
[147,"Imbaú","Ponta Grossa","Associação dos Municípios da Região dos Campos Gerais","Escritório Regional de Ponta Grossa","01613770000172"]
[148,"Imbituva","Ponta Grossa","Associação dos Municípios do Centro Sul do Paraná","Escritório Regional de Ponta Grossa",76175892000123]
[149,"Inácio Martins","Guarapuava","Associação dos Municípios do Centro Sul do Paraná","Escritório Regional de Guarapuava",76178029000120]
[150,"Inajá","Maringá","Associação dos Municípios do Noroeste do Paraná","Escritório Regional de Maringá",76970318000167]
[151,"Indianópolis","Maringá","Associação dos Municípios da Região de Entre Rios","Escritório Regional de Maringá",75798355000177]
[152,"Ipiranga","Ponta Grossa","Associação dos Municípios da Região dos Campos Gerais","Escritório Regional de Ponta Grossa",76175934000126]
[153,"Iporã","Maringá","Associação dos Municípios da Região de Entre Rios","Escritório Regional de Maringá",75738484000170]
[154,"Iracema do Oeste","Cascavel","Associação dos Municípios do Oeste do Paraná","Escritório Regional de Cascavel",95583555000110]
[155,"Irati","Guarapuava","Associação dos Municípios do Centro Sul do Paraná","Escritório Regional de Guarapuava",75654574000182]
[156,"Iretama","Guarapuava","Comunidade dos Municípios da Região de Campo Mourão","Escritório Regional de Guarapuava",76950088000174]
[157,"Itaguajé","Maringá","Associação dos Municípos do Setentrião Paranaense","Escritório Regional de Maringá",76970359000153]
[158,"Itaipulândia","Cascavel","Associação dos Municípios do Oeste do Paraná","Escritório Regional de Cascavel",95725057000164]
[159,"Itambaracá","Londrina","Associação dos Municípios do Norte do Paraná","Escritório Regional de Londrina",76235738000108]
[160,"Itambé","Maringá","Associação dos Municípos do Setentrião Paranaense","Escritório Regional de Maringá",76282698000147]
[161,"Itapejara d'Oeste","Francisco Beltrão","Associação dos Municípios do Sudoeste do Paraná","Escritório Regional de Francisco Betrão",76995430000152]
[162,"Itaperuçu","Curitiba","Associação dos Municípios da Região Metropolitana de Curitiba","Escritório Regional de Curitiba",95422846000126]
[163,"Itaúna do Sul","Maringá","Associação dos Municípios do Noroeste do Paraná","Escritório Regional de Maringá",75458836000133]
[164,"Ivaí","Ponta Grossa","Associação dos Municípios da Região dos Campos Gerais","Escritório Regional de Ponta Grossa",76175918000133]
[165,"Ivaiporã","Londrina","Associação dos Municípios do Vale do Ivaí","Escritório Regional de Londrina",75741330000137]
[166,"Ivaté","Maringá","Associação dos Municípios da Região de Entre Rios","Escritório Regional de Maringá",95640553000115]
[167,"Ivatuba","Maringá","Associação dos Municípos do Setentrião Paranaense","Escritório Regional de Maringá",76285337000154]
[168,"Jaboti","Londrina","Associação dos Municípios do Norte Pioneiro","Escritório Regional de Londrina",75969667000104]
[169,"Jacarezinho","Londrina","Associação dos Municípios do Norte Pioneiro","Escritório Regional de Londrina",76966860000146]
[170,"Jaguapitã","Londrina","Associação dos Municípios do Médio Paranapanema","Escritório Regional de Londrina",75457341000190]
[171,"Jaguariaíva","Ponta Grossa","Associação dos Municípios da Região dos Campos Gerais","Escritório Regional de Ponta Grossa",76910900000138]
[172,"Jandaia do Sul","Londrina","Associação dos Municípios do Vale do Ivaí","Escritório Regional de Londrina",75771204000125]
[173,"Janiópolis","Maringá","Comunidade dos Municípios da Região de Campo Mourão","Escritório Regional de Maringá",76402882000183]
[174,"Japira","Londrina","Associação dos Municípios do Norte Pioneiro","Escritório Regional de Londrina",75969881000152]
[175,"Japurá","Maringá","Associação dos Municípios da Região de Entre Rios","Escritório Regional de Maringá",75788349000139]
[176,"Jardim Alegre","Londrina","Associação dos Municípios do Vale do Ivaí","Escritório Regional de Londrina",75741363000187]
[177,"Jardim Olinda","Maringá","Associação dos Municípios do Noroeste do Paraná","Escritório Regional de Maringá",76970383000192]
[178,"Jataizinho","Londrina","Associação dos Municípios do Norte do Paraná","Escritório Regional de Londrina",76245042000154]
[179,"Jesuítas","Cascavel","Associação dos Municípios do Oeste do Paraná","Escritório Regional de Cascavel",77398154000108]
[180,"Joaquim Távora","Londrina","Associação dos Municípios do Norte Pioneiro","Escritório Regional de Londrina",76966845000106]
[181,"Jundiaí do Sul","Londrina","Associação dos Municípios do Norte Pioneiro","Escritório Regional de Londrina",76408061000154]
[182,"Juranda","Maringá","Comunidade dos Municípios da Região de Campo Mourão","Escritório Regional de Maringá",78196755000109]
[183,"Jussara","Maringá","Associação dos Municípios da Região de Entre Rios","Escritório Regional de Maringá",75789552000120]
[184,"Kaloré","Londrina","Associação dos Municípios do Vale do Ivaí","Escritório Regional de Londrina",75771238000110]
[185,"Lapa","Ponta Grossa","Associação dos Municípios da Região Metropolitana de Curitiba","Escritório Regional de Ponta Grossa",76020452000105]
[186,"Laranjal","Guarapuava","Associação dos Municípios do Centro do Paraná","Escritório Regional de Guarapuava",95684536000180]
[187,"Laranjeiras do Sul","Guarapuava","Associação dos Municípios do Cantuquiriguaçu","Escritório Regional de Guarapuava",76205970000195]
[188,"Leópolis","Londrina","Associação dos Municípios do Norte do Paraná","Escritório Regional de Londrina",75388850000108]
[189,"Lidianópolis","Londrina","Associação dos Municípios do Vale do Ivaí","Escritório Regional de Londrina",95680831000168]
[190,"Lindoeste","Cascavel","Associação dos Municípios do Oeste do Paraná","Escritório Regional de Cascavel",80881915000192]
[191,"Loanda","Maringá","Associação dos Municípios do Noroeste do Paraná","Escritório Regional de Maringá",76972074000151]
[192,"Lobato","Maringá","Associação dos Municípos do Setentrião Paranaense","Escritório Regional de Maringá",76970367000108]
[193,"Londrina","Londrina","Associação dos Municípios do Médio Paranapanema","Escritório Regional de Londrina",75771477000170]
[194,"Luiziana","Maringá","Comunidade dos Municípios da Região de Campo Mourão","Escritório Regional de Maringá",80888688000127]
[{"$f":"A195+1","v":195},"Lunardelli","Londrina","Associação dos Municípios do Vale do Ivaí","Escritório Regional de Londrina",78600491000107]
[196,"Lupionópolis","Londrina","Associação dos Municípios do Médio Paranapanema","Escritório Regional de Londrina",75845511000103]
[197,"Mallet","Ponta Grossa","Associação dos Municípios do Centro Sul do Paraná","Escritório Regional de Ponta Grossa",75654566000136]
[198,"Mamborê","Maringá","Comunidade dos Municípios da Região de Campo Mourão","Escritório Regional de Maringá",75368928000122]
[199,"Mandaguaçu","Maringá","Associação dos Municípos do Setentrião Paranaense","Escritório Regional de Maringá",76285329000108]
[200,"Mandaguari","Maringá","Associação dos Municípos do Setentrião Paranaense","Escritório Regional de Maringá",76285345000109]
[201,"Mandirituba","Curitiba","Associação dos Municípios da Região Metropolitana de Curitiba","Escritório Regional de Curitiba",76105550000137]
[202,"Manfrinópolis","Francisco Beltrão","Associação dos Municípios do Sudoeste do Paraná","Escritório Regional de Francisco Betrão","01614343000109"]
[203,"Mangueirinha","Francisco Beltrão","Associação dos Municípios do Sudoeste do Paraná","Escritório Regional de Francisco Betrão",77774867000129]
[204,"Manoel Ribas","Guarapuava","Associação dos Municípios do Centro do Paraná","Escritório Regional de Guarapuava",75740811000128]
[205,"Marechal Cândido Rondon","Cascavel","Associação dos Municípios do Oeste do Paraná","Escritório Regional de Cascavel",76205814000124]
[206,"Maria Helena","Maringá","Associação dos Municípios da Região de Entre Rios","Escritório Regional de Maringá",76247386000100]
[207,"Marialva","Maringá","Associação dos Municípos do Setentrião Paranaense","Escritório Regional de Maringá",76282680000145]
[208,"Marilândia do Sul","Londrina","Associação dos Municípios do Vale do Ivaí","Escritório Regional de Londrina",75771303000107]
[209,"Marilena","Maringá","Associação dos Municípios do Noroeste do Paraná","Escritório Regional de Maringá",75971010000173]
[210,"Mariluz","Maringá","Associação dos Municípios da Região de Entre Rios","Escritório Regional de Maringá",76404136000129]
[211,"Maringá","Maringá","Associação dos Municípos do Setentrião Paranaense","Escritório Regional de Maringá",76282656000106]
[212,"Mariópolis","Francisco Beltrão","Associação dos Municípios do Sudoeste do Paraná","Escritório Regional de Francisco Betrão",76995323000124]
[213,"Maripá","Cascavel","Associação dos Municípios do Oeste do Paraná","Escritório Regional de Cascavel",95583571000102]
[214,"Marmeleiro","Francisco Beltrão","Associação dos Municípios do Sudoeste do Paraná","Escritório Regional de Francisco Betrão",76205665000101]
[215,"Marquinho","Guarapuava","Associação dos Municípios do Cantuquiriguaçu","Escritório Regional de Guarapuava","01612552000113"]
[216,"Marumbi","Londrina","Associação dos Municípios do Vale do Ivaí","Escritório Regional de Londrina",75771246000166]
[217,"Matelândia","Cascavel","Associação dos Municípios do Oeste do Paraná","Escritório Regional de Cascavel",76206465000165]
[218,"Matinhos","Curitiba","Associação dos Municípios do Litoral do Paraná","Escritório Regional de Curitiba",76017466000161]
[219,"Mato Rico","Guarapuava","Associação dos Municípios do Centro do Paraná","Escritório Regional de Guarapuava",95684510000131]
[220,"Mauá da Serra","Londrina","Associação dos Municípios do Vale do Ivaí","Escritório Regional de Londrina",95548400000142]
[221,"Medianeira","Cascavel","Associação dos Municípios do Oeste do Paraná","Escritório Regional de Cascavel",76206481000158]
[222,"Mercedes","Cascavel","Associação dos Municípios do Oeste do Paraná","Escritório Regional de Cascavel",95719373000123]
[223,"Mirador","Maringá","Associação dos Municípios do Noroeste do Paraná","Escritório Regional de Maringá",75475442000193]
[224,"Miraselva","Londrina","Associação dos Municípios do Médio Paranapanema","Escritório Regional de Londrina",75845529000105]
[225,"Missal","Cascavel","Associação dos Municípios do Oeste do Paraná","Escritório Regional de Cascavel",78101847000150]
[226,"Moreira Sales","Maringá","Comunidade dos Municípios da Região de Campo Mourão","Escritório Regional de Maringá",76217025000103]
[227,"Morretes","Curitiba","Associação dos Municípios do Litoral do Paraná","Escritório Regional de Curitiba",76022490000199]
[228,"Munhoz de Mello","Maringá","Associação dos Municípos do Setentrião Paranaense","Escritório Regional de Maringá",75352062000161]
[229,"Nossa Senhora das Graças","Maringá","Associação dos Municípos do Setentrião Paranaense","Escritório Regional de Maringá",76970300000165]
[230,"Nova Aliança do Ivaí","Maringá","Associação dos Municípios do Noroeste do Paraná","Escritório Regional de Maringá",76413061000142]
[231,"Nova América da Colina","Londrina","Associação dos Municípios do Norte do Paraná","Escritório Regional de Londrina",75827204000108]
[232,"Nova Aurora","Cascavel","Associação dos Municípios do Oeste do Paraná","Escritório Regional de Cascavel",76208859000152]
[233,"Nova Cantu","Maringá","Comunidade dos Municípios da Região de Campo Mourão","Escritório Regional de Maringá",77845394000103]
[234,"Nova Esperança","Maringá","Associação dos Municípos do Setentrião Paranaense","Escritório Regional de Maringá",75730994000109]
[235,"Nova Esperança do Sudoeste","Francisco Beltrão","Associação dos Municípios do Sudoeste do Paraná","Escritório Regional de Francisco Betrão",95589289000132]
[236,"Nova Fátima","Londrina","Associação dos Municípios do Norte do Paraná","Escritório Regional de Londrina",75828418000190]
[237,"Nova Laranjeiras","Guarapuava","Associação dos Municípios do Cantuquiriguaçu","Escritório Regional de Guarapuava",95587648000112]
[238,"Nova Londrina","Maringá","Associação dos Municípios do Noroeste do Paraná","Escritório Regional de Maringá",81044984000104]
[239,"Nova Olímpia","Maringá","Associação dos Municípios da Região de Entre Rios","Escritório Regional de Maringá",75799577000104]
[240,"Nova Prata do Iguaçu","Francisco Beltrão","Associação dos Municípios do Sudoeste do Paraná","Escritório Regional de Francisco Betrão",78103884000105]
[241,"Nova Santa Bárbara","Londrina","Associação dos Municípios do Norte do Paraná","Escritório Regional de Londrina",95561080000160]
[242,"Nova Santa Rosa","Cascavel","Associação dos Municípios do Oeste do Paraná","Escritório Regional de Cascavel",77116663000109]
[243,"Nova Tebas","Guarapuava","Associação dos Municípios do Centro do Paraná","Escritório Regional de Guarapuava",80620172000105]
[244,"Novo Itacolomi","Londrina","Associação dos Municípios do Vale do Ivaí","Escritório Regional de Londrina",95639472000103]
[245,"Ortigueira","Ponta Grossa","Associação dos Municípios da Região dos Campos Gerais","Escritório Regional de Ponta Grossa",77721363000140]
[246,"Ourizona","Maringá","Associação dos Municípos do Setentrião Paranaense","Escritório Regional de Maringá",76282672000107]
[247,"Ouro Verde do Oeste","Cascavel","Associação dos Municípios do Oeste do Paraná","Escritório Regional de Cascavel",80880107000100]
[248,"Paiçandu","Maringá","Associação dos Municípos do Setentrião Paranaense","Escritório Regional de Maringá",76282664000152]
[249,"Palmas","Francisco Beltrão","Associação dos Municípios do Sudoeste do Paraná","Escritório Regional de Francisco Betrão",76161181000108]
[250,"Palmeira","Ponta Grossa","Associação dos Municípios da Região dos Campos Gerais","Escritório Regional de Ponta Grossa",76179829000165]
[251,"Palmital","Guarapuava","Associação dos Municípios do Centro do Paraná","Escritório Regional de Guarapuava",75680025000182]
[252,"Palotina","Cascavel","Associação dos Municípios do Oeste do Paraná","Escritório Regional de Cascavel",76208487000164]
[253,"Paraíso do Norte","Maringá","Associação dos Municípios do Noroeste do Paraná","Escritório Regional de Maringá",75476556000158]
[254,"Paranacity","Maringá","Associação dos Municípos do Setentrião Paranaense","Escritório Regional de Maringá",76970334000150]
[255,"Paranaguá","Curitiba","Associação dos Municípios do Litoral do Paraná","Escritório Regional de Curitiba",76017458000115]
[256,"Paranapoema","Maringá","Associação dos Municípios do Noroeste do Paraná","Escritório Regional de Maringá",76970391000139]
[257,"Paranavaí","Maringá","Associação dos Municípios do Noroeste do Paraná","Escritório Regional de Maringá",76977768000181]
[258,"Pato Bragado","Cascavel","Associação dos Municípios do Oeste do Paraná","Escritório Regional de Cascavel",95719472000105]
[{"$f":"A259+1","v":259},"Pato Branco","Francisco Beltrão","Associação dos Municípios do Sudoeste do Paraná","Escritório Regional de Francisco Betrão",76995448000154]
[260,"Paula Freitas","Guarapuava","Associação dos Municípios do Sul do Paraná","Escritório Regional de Guarapuava",75687954000113]
[261,"Paulo Frontin","Ponta Grossa","Associação dos Municípios do Sul do Paraná","Escritório Regional de Ponta Grossa",77007474000190]
[262,"Peabiru","Maringá","Comunidade dos Municípios da Região de Campo Mourão","Escritório Regional de Maringá",75370148000117]
[263,"Perobal","Maringá","Associação dos Municípios da Região de Entre Rios","Escritório Regional de Maringá","01612444000140"]
[264,"Pérola","Maringá","Associação dos Municípios da Região de Entre Rios","Escritório Regional de Maringá",81478133000170]
[265,"Pérola d'Oeste","Francisco Beltrão","Associação dos Municípios do Sudoeste do Paraná","Escritório Regional de Francisco Betrão",75924290000169]
[266,"Piên","Curitiba","Associação dos Municípios da Região Suleste do Paraná","Escritório Regional de Curitiba",76002666000140]
[267,"Pinhais","Curitiba","Associação dos Municípios da Região Metropolitana de Curitiba","Escritório Regional de Curitiba",95423000000100]
[268,"Pinhal de São Bento","Francisco Beltrão","Associação dos Municípios do Sudoeste do Paraná","Escritório Regional de Francisco Betrão",95590832000111]
[269,"Pinhalão","Londrina","Associação dos Municípios do Norte Pioneiro","Escritório Regional de Londrina",76167717000194]
[270,"Pinhão","Guarapuava","Associação dos Municípios do Cantuquiriguaçu","Escritório Regional de Guarapuava",76178011000128]
[271,"Piraí do Sul","Ponta Grossa","Associação dos Municípios da Região dos Campos Gerais","Escritório Regional de Ponta Grossa",77001329000100]
[272,"Piraquara","Curitiba","Associação dos Municípios da Região Metropolitana de Curitiba","Escritório Regional de Curitiba",76105675000167]
[273,"Pitanga","Guarapuava","Associação dos Municípios do Centro do Paraná","Escritório Regional de Guarapuava",76172907000108]
[274,"Pitangueiras","Londrina","Associação dos Municípios do Médio Paranapanema","Escritório Regional de Londrina",95543427000142]
[275,"Planaltina do Paraná","Maringá","Associação dos Municípios do Noroeste do Paraná","Escritório Regional de Maringá",75461442000134]
[276,"Planalto","Francisco Beltrão","Associação dos Municípios do Sudoeste do Paraná","Escritório Regional de Francisco Betrão",76460526000116]
[277,"Ponta Grossa","Ponta Grossa","Associação dos Municípios da Região dos Campos Gerais","Escritório Regional de Ponta Grossa",76175884000187]
[278,"Pontal do Paraná","Curitiba","Associação dos Municípios do Litoral do Paraná","Escritório Regional de Curitiba","01609843000152"]
[279,"Porecatu","Londrina","Associação dos Municípios do Médio Paranapanema","Escritório Regional de Londrina",80542764000148]
[280,"Porto Amazonas","Ponta Grossa","Associação dos Municípios da Região dos Campos Gerais","Escritório Regional de Ponta Grossa",76179837000101]
[281,"Porto Barreiro","Guarapuava","Associação dos Municípios do Cantuquiriguaçu","Escritório Regional de Guarapuava","01591618000136"]
[282,"Porto Rico","Maringá","Associação dos Municípios do Noroeste do Paraná","Escritório Regional de Maringá",75461970000193]
[283,"Porto Vitória","Ponta Grossa","Associação dos Municípios do Sul do Paraná","Escritório Regional de Ponta Grossa",75688366000102]
[284,"Prado Ferreira","Londrina","Associação dos Municípios do Médio Paranapanema","Escritório Regional de Londrina","01613136000130"]
[285,"Pranchita","Francisco Beltrão","Associação dos Municípios do Sudoeste do Paraná","Escritório Regional de Francisco Betrão",78113834000109]
[286,"Presidente Castelo Branco","Maringá","Associação dos Municípos do Setentrião Paranaense","Escritório Regional de Maringá",76279959000170]
[287,"Primeiro de Maio","Londrina","Associação dos Municípios do Médio Paranapanema","Escritório Regional de Londrina",76245059000101]
[288,"Prudentópolis","Guarapuava","Associação dos Municípios do Centro Sul do Paraná","Escritório Regional de Guarapuava",77003424000134]
[289,"Quarto Centenário","Maringá","Comunidade dos Municípios da Região de Campo Mourão","Escritório Regional de Maringá","01619104000141"]
[290,"Quatiguá","Londrina","Associação dos Municípios do Norte Pioneiro","Escritório Regional de Londrina",76966852000108]
[291,"Quatro Barras","Curitiba","Associação dos Municípios da Região Metropolitana de Curitiba","Escritório Regional de Curitiba",76105568000139]
[292,"Quatro Pontes","Cascavel","Associação dos Municípios do Oeste do Paraná","Escritório Regional de Cascavel",95719381000170]
[293,"Quedas do Iguaçu","Guarapuava","Associação dos Municípios do Cantuquiriguaçu","Escritório Regional de Guarapuava",76205962000149]
[294,"Querência do Norte","Maringá","Associação dos Municípios do Noroeste do Paraná","Escritório Regional de Maringá",76973692000116]
[295,"Quinta do Sol","Maringá","Comunidade dos Municípios da Região de Campo Mourão","Escritório Regional de Maringá",76950047000188]
[296,"Quitandinha","Curitiba","Associação dos Municípios da Região Suleste do Paraná","Escritório Regional de Curitiba",76002674000197]
[297,"Ramilândia","Cascavel","Associação dos Municípios do Oeste do Paraná","Escritório Regional de Cascavel",95725024000114]
[298,"Rancho Alegre","Londrina","Associação dos Municípios do Norte do Paraná","Escritório Regional de Londrina",75829416000116]
[299,"Rancho Alegre d'Oeste","Maringá","Comunidade dos Municípios da Região de Campo Mourão","Escritório Regional de Maringá",95640132000194]
[300,"Realeza","Francisco Beltrão","Associação dos Municípios do Sudoeste do Paraná","Escritório Regional de Francisco Betrão",76205673000140]
[301,"Rebouças","Ponta Grossa","Associação dos Municípios do Centro Sul do Paraná","Escritório Regional de Ponta Grossa",77774859000182]
[302,"Renascença","Francisco Beltrão","Associação dos Municípios do Sudoeste do Paraná","Escritório Regional de Francisco Betrão",76205681000196]
[303,"Reserva","Ponta Grossa","Associação dos Municípios da Região dos Campos Gerais","Escritório Regional de Ponta Grossa",76169879000161]
[304,"Reserva do Iguaçu","Guarapuava","Associação dos Municípios do Cantuquiriguaçu","Escritório Regional de Guarapuava","01612911000132"]
[305,"Ribeirão Claro","Londrina","Associação dos Municípios do Norte Pioneiro","Escritório Regional de Londrina",75449579000173]
[306,"Ribeirão do Pinhal","Londrina","Associação dos Municípios do Norte Pioneiro","Escritório Regional de Londrina",76968064000142]
[307,"Rio Azul","Ponta Grossa","Associação dos Municípios do Centro Sul do Paraná","Escritório Regional de Ponta Grossa",75963256000101]
[308,"Rio Bom","Londrina","Associação dos Municípios do Vale do Ivaí","Escritório Regional de Londrina",75771212000171]
[309,"Rio Bonito do Iguaçu","Guarapuava","Associação dos Municípios do Cantuquiriguaçu","Escritório Regional de Guarapuava",95587770000199]
[310,"Rio Branco do Ivaí","Londrina","Associação dos Municípios do Vale do Ivaí","Escritório Regional de Londrina","01612413000190"]
[311,"Rio Branco do Sul","Curitiba","Associação dos Municípios da Região Metropolitana de Curitiba","Escritório Regional de Curitiba",76105576000185]
[312,"Rio Negro","Curitiba","Associação dos Municípios da Região Suleste do Paraná","Escritório Regional de Curitiba",76002641000147]
[313,"Rolândia","Londrina","Associação dos Municípios do Médio Paranapanema","Escritório Regional de Londrina",76288760000108]
[314,"Roncador","Guarapuava","Associação dos Municípios do Centro do Paraná","Escritório Regional de Guarapuava",75371401000157]
[315,"Rondon","Maringá","Associação dos Municípios da Região de Entre Rios","Escritório Regional de Maringá",75380071000166]
[316,"Rosário do Ivaí","Londrina","Associação dos Municípios do Vale do Ivaí","Escritório Regional de Londrina",80059264000150]
[317,"Sabáudia","Londrina","Associação dos Municípios do Médio Paranapanema","Escritório Regional de Londrina",76958974000144]
[318,"Salgado Filho","Francisco Beltrão","Associação dos Municípios do Sudoeste do Paraná","Escritório Regional de Francisco Betrão",76205699000198]
[319,"Salto do Itararé","Londrina","Associação dos Municípios do Norte Pioneiro","Escritório Regional de Londrina",76920834000187]
[320,"Salto do Lontra","Francisco Beltrão","Associação dos Municípios do Sudoeste do Paraná","Escritório Regional de Francisco Betrão",76205707000104]
[321,"Santa Amélia","Londrina","Associação dos Municípios do Norte do Paraná","Escritório Regional de Londrina",76235746000146]
[322,"Santa Cecília do Pavão","Londrina","Associação dos Municípios do Norte do Paraná","Escritório Regional de Londrina",76290691000177]
[{"$f":"A323+1","v":323},"Santa Cruz do Monte Castelo","Maringá","Associação dos Municípios do Noroeste do Paraná","Escritório Regional de Maringá",75462820000102]
[324,"Santa Fé","Maringá","Associação dos Municípos do Setentrião Paranaense","Escritório Regional de Maringá",76291418000167]
[325,"Santa Helena","Cascavel","Associação dos Municípios do Oeste do Paraná","Escritório Regional de Cascavel",76206457000119]
[326,"Santa Inês","Maringá","Associação dos Municípos do Setentrião Paranaense","Escritório Regional de Maringá",78092293000171]
[327,"Santa Isabel do Ivaí","Maringá","Associação dos Municípios do Noroeste do Paraná","Escritório Regional de Maringá",76974823000180]
[328,"Santa Izabel do Oeste","Francisco Beltrão","Associação dos Municípios do Sudoeste do Paraná","Escritório Regional de Francisco Betrão",76205715000142]
[329,"Santa Lúcia","Cascavel","Associação dos Municípios do Oeste do Paraná","Escritório Regional de Cascavel",95594776000193]
[330,"Santa Maria do Oeste","Guarapuava","Associação dos Municípios do Centro do Paraná","Escritório Regional de Guarapuava",95684544000126]
[331,"Santa Mariana","Londrina","Associação dos Municípios do Norte do Paraná","Escritório Regional de Londrina",75392019000120]
[332,"Santa Mônica","Maringá","Associação dos Municípios do Noroeste do Paraná","Escritório Regional de Maringá",95641916000137]
[333,"Santa Tereza do Oeste","Cascavel","Associação dos Municípios do Oeste do Paraná","Escritório Regional de Cascavel",80882095000153]
[334,"Santa Terezinha de Itaipu","Cascavel","Associação dos Municípios do Oeste do Paraná","Escritório Regional de Cascavel",75425314000135]
[335,"Santana do Itararé","Londrina","Associação dos Municípios do Norte Pioneiro","Escritório Regional de Londrina",76920826000130]
[336,"Santo Antônio da Platina","Londrina","Associação dos Municípios do Norte Pioneiro","Escritório Regional de Londrina",76968627000100]
[337,"Santo Antônio do Caiuá","Maringá","Associação dos Municípios do Noroeste do Paraná","Escritório Regional de Maringá",75483230000158]
[338,"Santo Antônio do Paraíso","Londrina","Associação dos Municípios do Norte do Paraná","Escritório Regional de Londrina",75832170000131]
[339,"Santo Antônio do Sudoeste","Francisco Beltrão","Associação dos Municípios do Sudoeste do Paraná","Escritório Regional de Francisco Betrão",75927582000155]
[340,"Santo Inácio","Maringá","Associação dos Municípos do Setentrião Paranaense","Escritório Regional de Maringá",76970375000146]
[341,"São Carlos do Ivaí","Maringá","Associação dos Municípios do Noroeste do Paraná","Escritório Regional de Maringá",75498576000120]
[342,"São Jerônimo da Serra","Londrina","Associação dos Municípios do Norte do Paraná","Escritório Regional de Londrina",76290683000120]
[343,"São João","Francisco Beltrão","Associação dos Municípios do Sudoeste do Paraná","Escritório Regional de Francisco Betrão",76995422000106]
[344,"São João do Caiuá","Maringá","Associação dos Municípios do Noroeste do Paraná","Escritório Regional de Maringá",76238435000130]
[345,"São João do Ivaí","Londrina","Associação dos Municípios do Vale do Ivaí","Escritório Regional de Londrina",75741355000130]
[346,"São João do Triunfo","Ponta Grossa","Associação dos Municípios do Sul do Paraná","Escritório Regional de Ponta Grossa",75193516000107]
[347,"São Jorge do Ivaí","Maringá","Associação dos Municípos do Setentrião Paranaense","Escritório Regional de Maringá",76282649000104]
[348,"São Jorge do Patrocínio","Maringá","Associação dos Municípios da Região de Entre Rios","Escritório Regional de Maringá",77870475000163]
[349,"São Jorge d'Oeste","Francisco Beltrão","Associação dos Municípios do Sudoeste do Paraná","Escritório Regional de Francisco Betrão",76995380000103]
[350,"São José da Boa Vista","Londrina","Associação dos Municípios do Norte Pioneiro","Escritório Regional de Londrina",76920818000194]
[351,"São José das Palmeiras","Cascavel","Associação dos Municípios do Oeste do Paraná","Escritório Regional de Cascavel",77819605000133]
[352,"São José dos Pinhais","Curitiba","Associação dos Municípios da Região Metropolitana de Curitiba","Escritório Regional de Curitiba",76105543000135]
[353,"São Manoel do Paraná","Maringá","Associação dos Municípios da Região de Entre Rios","Escritório Regional de Maringá",80909617000163]
[354,"São Mateus do Sul","Ponta Grossa","Associação dos Municípios do Sul do Paraná","Escritório Regional de Ponta Grossa",76021450000122]
[355,"São Miguel do Iguaçu","Cascavel","Associação dos Municípios do Oeste do Paraná","Escritório Regional de Cascavel",76206499000150]
[356,"São Pedro do Iguaçu","Cascavel","Associação dos Municípios do Oeste do Paraná","Escritório Regional de Cascavel",95583597000150]
[357,"São Pedro do Ivaí","Londrina","Associação dos Municípios do Vale do Ivaí","Escritório Regional de Londrina",75771311000153]
[358,"São Pedro do Paraná","Maringá","Associação dos Municípios do Noroeste do Paraná","Escritório Regional de Maringá",76975259000110]
[359,"São Sebastião da Amoreira","Londrina","Associação dos Municípios do Norte do Paraná","Escritório Regional de Londrina",76290659000191]
[360,"São Tomé","Maringá","Associação dos Municípios da Região de Entre Rios","Escritório Regional de Maringá",75381178000129]
[361,"Sapopema","Londrina","Associação dos Municípios do Norte do Paraná","Escritório Regional de Londrina",76167733000187]
[362,"Sarandi","Maringá","Associação dos Municípos do Setentrião Paranaense","Escritório Regional de Maringá",78200482000110]
[363,"Saudade do Iguaçu","Francisco Beltrão","Associação dos Municípios do Sudoeste do Paraná","Escritório Regional de Francisco Betrão",95585477000192]
[364,"Sengés","Ponta Grossa","Associação dos Municípios da Região dos Campos Gerais","Escritório Regional de Ponta Grossa",76911676000107]
[365,"Serranópolis do Iguaçu","Cascavel","Associação dos Municípios do Oeste do Paraná","Escritório Regional de Cascavel","01613052000104"]
[366,"Sertaneja","Londrina","Associação dos Municípios do Norte do Paraná","Escritório Regional de Londrina",75393082000180]
[367,"Sertanópolis","Londrina","Associação dos Municípios do Médio Paranapanema","Escritório Regional de Londrina",76245034000108]
[368,"Siqueira Campos","Londrina","Associação dos Municípios do Norte Pioneiro","Escritório Regional de Londrina",76919083000189]
[369,"Sulina","Francisco Beltrão","Associação dos Municípios do Sudoeste do Paraná","Escritório Regional de Francisco Betrão",80869886000143]
[370,"Tamarana","Londrina","Associação dos Municípios do Médio Paranapanema","Escritório Regional de Londrina","01613167000190"]
[371,"Tamboara","Maringá","Associação dos Municípios do Noroeste do Paraná","Escritório Regional de Maringá",76978519000100]
[372,"Tapejara","Maringá","Associação dos Municípios da Região de Entre Rios","Escritório Regional de Maringá",76247345000106]
[373,"Tapira","Maringá","Associação dos Municípios da Região de Entre Rios","Escritório Regional de Maringá",75801738000157]
[374,"Teixeira Soares","Ponta Grossa","Associação dos Municípios do Centro Sul do Paraná","Escritório Regional de Ponta Grossa",75963850000194]
[375,"Telêmaco Borba","Ponta Grossa","Associação dos Municípios da Região dos Campos Gerais","Escritório Regional de Ponta Grossa",76170240000104]
[376,"Terra Boa","Maringá","Comunidade dos Municípios da Região de Campo Mourão","Escritório Regional de Maringá",75793786000140]
[377,"Terra Rica","Maringá","Associação dos Municípios do Noroeste do Paraná","Escritório Regional de Maringá",76978881000181]
[378,"Terra Roxa","Cascavel","Associação dos Municípios do Oeste do Paraná","Escritório Regional de Cascavel",75587204000170]
[379,"Tibagi","Ponta Grossa","Associação dos Municípios da Região dos Campos Gerais","Escritório Regional de Ponta Grossa",76170257000153]
[380,"Tijucas do Sul","Curitiba","Associação dos Municípios da Região Metropolitana de Curitiba","Escritório Regional de Curitiba",76105584000121]
[381,"Toledo","Cascavel","Associação dos Municípios do Oeste do Paraná","Escritório Regional de Cascavel",76205806000188]
[382,"Tomazina","Londrina","Associação dos Municípios do Norte Pioneiro","Escritório Regional de Londrina",75697094000107]
[383,"Três Barras do Paraná","Cascavel","Associação dos Municípios do Oeste do Paraná","Escritório Regional de Cascavel",78121936000168]
[384,"Tunas do Paraná","Curitiba","Associação dos Municípios da Região Metropolitana de Curitiba","Escritório Regional de Curitiba",68703834000105]
[385,"Tuneiras do Oeste","Maringá","Associação dos Municípios da Região de Entre Rios","Escritório Regional de Maringá",76247329000113]
[386,"Tupãssi","Cascavel","Associação dos Municípios do Oeste do Paraná","Escritório Regional de Cascavel",77877116000138]
[{"$f":"A387+1","v":387},"Turvo","Guarapuava","Associação dos Municípios do Centro do Paraná","Escritório Regional de Guarapuava",78279973000107]
[388,"Ubiratã","Maringá","Comunidade dos Municípios da Região de Campo Mourão","Escritório Regional de Maringá",76950096000110]
[389,"Umuarama","Maringá","Associação dos Municípios da Região de Entre Rios","Escritório Regional de Maringá",76247378000156]
[390,"União da Vitória","Ponta Grossa","Associação dos Municípios do Sul do Paraná","Escritório Regional de Ponta Grossa",75967760000171]
[391,"Uniflor","Maringá","Associação dos Municípos do Setentrião Paranaense","Escritório Regional de Maringá",76279975000162]
[392,"Uraí","Londrina","Associação dos Municípios do Norte Pioneiro","Escritório Regional de Londrina",75424507000171]
[393,"Ventania","Ponta Grossa","Associação dos Municípios da Região dos Campos Gerais","Escritório Regional de Ponta Grossa",95685798000169]
[394,"Vera Cruz do Oeste","Cascavel","Associação dos Municípios do Oeste do Paraná","Escritório Regional de Cascavel",78101821000101]
[395,"Verê","Francisco Beltrão","Associação dos Municípios do Sudoeste do Paraná","Escritório Regional de Francisco Betrão",75636530000120]
[396,"Virmond","Guarapuava","Associação dos Municípios do Cantuquiriguaçu","Escritório Regional de Guarapuava",95587622000174]
[397,"Vitorino","Francisco Beltrão","Associação dos Municípios do Sudoeste do Paraná","Escritório Regional de Francisco Betrão",76995463000100]
[398,"Wenceslau Braz","Londrina","Associação dos Municípios do Norte Pioneiro","Escritório Regional de Londrina",76920800000192]
[399,"Xambrê","Maringá","Associação dos Municípios da Região de Entre Rios","Escritório Regional de Maringá",76247360000154]
[]
[null,{"$f":"SUBTOTAL(3,B2:B400)","v":399}]